Register for your free account! | Forgot your password?

You last visited: Today at 08:11

  • Please register to post and access all features, it's quick, easy and FREE!

Advertisement



4.3.4 Compile Error

Discussion on 4.3.4 Compile Error within the WoW Private Server forum part of the World of Warcraft category.

Reply
 
Old   #1
 
elite*gold: 0
Join Date: Mar 2018
Posts: 5
Received Thanks: 2
4.3.4 Compile Error

Halloouuuu

Bin aktuell dabei, auf Debian 10 64 Bit eine 4.3.4 Core zu compilen (nicht trinity)

Bekomme aber immer folgende Error und weiß aktuell nicht weiter:


In file included from /home/434core/src/server/shared/Cryptography/ARC4.cpp:19:
/home/434core/src/server/shared/Cryptography/ARC4.h:34:24: error: field 'm_ctx' has incom plete type 'EVP_CIPHER_CTX' {aka 'evp_cipher_ctx_st'}
EVP_CIPHER_CTX m_ctx;
^~~~~
In file included from /usr/include/openssl/evp.h:14,
from /home/434core/src/server/shared/Cryptography/ARC4.h:23,
from /home/434core/src/server/shared/Cryptography/ARC4.cpp:19:
/usr/include/openssl/ossl_typ.h:90:16: note: forward declaration of 'EVP_CIPHER_CTX' {aka 'st ruct evp_cipher_ctx_st'}
typedef struct evp_cipher_ctx_st EVP_CIPHER_CTX;
^~~~~~~~~~~~~~~~~
make[2]: *** [src/server/shared/CMakeFiles/shared.dir/build.make:76: src/server/shared/CMakeF iles/shared.dir/Cryptography/ARC4.cpp.o] Error 1
make[1]: *** [CMakeFiles/Makefile2:595: src/server/shared/CMakeFiles/shared.dir/all] Error 2
make: *** [Makefile:130: all] Error 2


Habe zunächst ein bisschen nachgeforscht, laut TrinityCore ist das ein OpenSSL Fehler, da man nur 1.0.x Versionen nutzen sollte (hatte 1.1.1) also runter damit und die 1.0.2 drauf, funktioniert leider auch nicht, hoffe dass hier jemand eine Idee hat



Damieninabox is offline  
Reply



« Warmane Account Warr+SHADOWMOURNE | Suche Privaten Server »

Similar Threads
[Source Problem] Compile Error
05/29/2011 - Flyff Private Server - 8 Replies
Hallo ePvpers, neuerdings bekomme ich seit circa 3 Tagen beim Compilen von meinem Source immer diese Errors: Woran liegt das, würde mich sehr über Hilfe freuen, Danke.
World compile error
12/15/2010 - Flyff Private Server - 2 Replies
Hi und zwar enn ich meinen world server (andem hab ich noch garnix gemacht) compilen will kommt dieser error hier: kann mir vielelciht helfen?
[HELP] Compile error with LOTF(i know LOTF sucks but just help)
06/19/2009 - CO2 Private Server - 3 Replies
It says: Loaded 254 portals. Loaded 1027 NPCs. Loaded 37 mobs. Loaded 11147 items. Loaded 172 mob spawns. System.ArgumentOutOfRangeException: 'minValue' cannot be greater then mxValue. Parameter name : minValue at System.Random.Next<Int32 minValue, Int32 maxValue> at COServer_Project.Mobs.SpawnAllMobs<> in C:\Documents and Settings\Admin\My Documents\COServerProject1\COServerProject\Entitie s.cs:line 207
[CoV2] Compile Error - need some helps
02/07/2009 - CO2 Private Server - 7 Replies
First of all i'd like to say i'm not that average noob that downloads a source, compiles it, gets errors and posts it on forums right away... I've been trying to look for a solution myself. I am not a pro C# Coder but i am familiar with its basics. This is the error i get on compiling " Error 1 Unexpected error creating debug information file 'C:\Users\Conquer\Desktop\CoV2\CoV2\CoV2\obj\Relea se\COServerProject.PDB' -- 'Unspecified error' " At first i thought it would have been...



All times are GMT +1. The time now is 08:11.


Powered by vBulletin®
Copyright ©2000 - 2020, Jelsoft Enterprises Ltd.
SEO by vBSEO ©2011, Crawlability, Inc.

BTC: 33E6kMtxYa7dApCFzrS3Jb7U3NrVvo8nsK
ETH: 0xc6ec801B7563A4376751F33b0573308aDa611E05

Support | Contact Us | FAQ | Advertising | Privacy Policy | Terms of Service | Abuse
Copyright ©2019 elitepvpers All Rights Reserved.