Register for your free account! | Forgot your password?

Go Back   elitepvpers > World of Warcraft > WoW Private Server
You last visited: Today at 04:42

  • Please register to post and access all features, it's quick, easy and FREE!


Script Compilen fehler

Reply
 
Old   #1
 
elite*gold: 0
Join Date: Oct 2014
Posts: 6
Received Thanks: 0
Script Compilen fehler

Heyho hab ein script eingefügt und wollte dann die core neu Compilieren aber dann kommt immer diese fehlermeldung:

/root/335aTC/TrinityCore/src/server/game/Accounts/AccountMgr.cpp: In static member function ‘static bool AccountMgr::IsAdminAccount(uint32)’:
/root/335aTC/TrinityCore/src/server/game/Accounts/AccountMgr.cpp:397:23: error: ‘SEC_ADMINISTRATOR’ was not declared in this scope
compilation terminated due to -Wfatal-errors.
make[2]: *** [src/server/game/CMakeFiles/game.dir/Accounts/AccountMgr.cpp.o] Fehler 1
make[1]: *** [src/server/game/CMakeFiles/game.dir/all] Fehler 2


Hilfe!!



Stensch is offline  
Old 11/03/2014, 07:42   #2
 
elite*gold: 110
Join Date: Mar 2008
Posts: 837
Received Thanks: 370
Ohne Sourcecode wird dir keiner helfen können.
Was genau hast du an der AccountMgr.cpp geändert?


Kaev <3 is offline  
Old 11/04/2014, 15:58   #3

 
elite*gold: 60
Join Date: Sep 2012
Posts: 4,239
Received Thanks: 3,027
Quote:
Originally Posted by Stensch View Post
Heyho hab ein script eingefügt und wollte dann die core neu Compilieren aber dann kommt immer diese fehlermeldung:

/root/335aTC/TrinityCore/src/server/game/Accounts/AccountMgr.cpp: In static member function ‘static bool AccountMgr::IsAdminAccount(uint32)’:
/root/335aTC/TrinityCore/src/server/game/Accounts/AccountMgr.cpp:397:23: error: ‘SEC_ADMINISTRATOR’ was not declared in this scope
compilation terminated due to -Wfatal-errors.
make[2]: *** [src/server/game/CMakeFiles/game.dir/Accounts/AccountMgr.cpp.o] Fehler 1
make[1]: *** [src/server/game/CMakeFiles/game.dir/all] Fehler 2


Hilfe!!
/root/335aTC/TrinityCore/src/server/game/Accounts/AccountMgr.cpp:397:23: error: ‘SEC_ADMINISTRATOR’ was not declared in this scope

Wurde nicht deklariert ? Also fehlt da eine Deklaration. Dann solltest du compilen können ^^
- DK ACE is offline  
Reply



« MySQL Fehler WoW 3.3.5a | World of Warcraft - Cataclysm Launcher design »

Similar Threads
Fehler beim Compilen
02/18/2013 - WoW Private Server - 10 Replies
Ich habe mir die Aktuelle Trinity geladen, aber leider spuckt er mir bei 99% einen Fehler aus :confused: Hier mal der Screen: http://www10.pic-upload.de/17.02.13/fcrhdmqjzh.png Ich hoffe ihr könnt mir dabei helfen
Pawno fehler beim compilen
07/24/2012 - General Coding - 1 Replies
Hey leute bekomme immer folgenden fehler wen i das script compieln will ;( C:\Users\chrisi\Desktop\Untitled.pwn(17281) : warning 219: local variable "string" shadows a variable at a preceding level C:\Users\chrisi\Desktop\Untitled.pwn(17289) :...
Fehler beim compilen der RoC Source :\
01/24/2012 - Flyff PServer - Discussions / Questions - 3 Replies
Hallo ..! Ich habe beim compilen Folgende Fehler bekommen .. C:\Bloody Angels\Build\Program\_Common\Colosseum.cpp(346): warning C4018: '<' : signed/unsigned mismatch C:\Bloody Angels\Build\Program\_Common\Colosseum.cpp(331): warning C4018:...
Mir Unbekannter Fehler nach Compilen
11/16/2011 - Flyff PServer - Discussions / Questions - 7 Replies
HI E*Pvpers, ich habe jetzt einige Sachen in der Source geändert und das Compilen ist auch ohne Probleme gegangen. Die Server laufen ohne error, aber wenn ich die Neuz starte, kommt der Fehler: ...
[v15 Source]Fehler beim Compilen
07/17/2011 - Flyff PServer - Discussions / Questions - 12 Replies
Guten Tag , Habe folgende Fehler : Diese aber nur in der Neuz und im LoginServer. Wisst da mehr ? Linkungen sind alle richtig gesetzt.



All times are GMT +2. The time now is 04:42.


Powered by vBulletin®
Copyright ©2000 - 2018, Jelsoft Enterprises Ltd.
SEO by vBSEO ©2011, Crawlability, Inc.

Support | Contact Us | FAQ | Advertising | Privacy Policy | Abuse
Copyright ©2018 elitepvpers All Rights Reserved.