Do I have to build new executable files for this? Because AccountServer.exe is fine but when I open Certifier.exe it will open but is not responding and will close eventually.
When I compile the source in the VS 2012 it cannot find this two files:
Do I have to build new executable files for this? Because AccountServer.exe is fine but when I open Certifier.exe it will open but is not responding and will close eventually.
When I compile the source in the VS 2012 it cannot find this two files:
Download VS 2012 Express + Install it
Download Vs 2013 Community + Install it
Download Vs 2013 Mfc + install it
Open Vs 2013 and change the compiler version to 2012 ..
Hi people, I have installed VS 2012 Ultimate, I can compile successfully all the executables except for Neuz and WorldServer. Did I miss anything? I really need help with this.
Also when I open the certifier.exe after the accountserver, it will be opened but is not responding and will eventually crash after a while what could be the problem?
Error 1 error C2146: syntax error : missing ';' before identifier 'PVOID64' C:\Program Files (x86)\Windows Kits\8.0\Include\um\winnt.h 301
Error 2 error C4430: missing type specifier - int assumed. Note: C++ does not support default-int C:\Program Files (x86)\Windows Kits\8.0\Include\um\winnt.h 301
Error 3 error C2146: syntax error : missing ';' before identifier 'Buffer' C:\Program Files (x86)\Windows Kits\8.0\Include\um\winnt.h 11698
Error 4 error C4430: missing type specifier - int assumed. Note: C++ does not support default-int C:\Program Files (x86)\Windows Kits\8.0\Include\um\winnt.h 11698
Error 5 error C3861: 'memcpy_s': identifier not found C:\Program Files (x86)\Microsoft Visual Studio 11.0\VC\atlmfc\include\atlconv.h 746
Error 6 error C3861: 'wcscat_s': identifier not found C:\Program Files (x86)\Microsoft Visual Studio 11.0\VC\atlmfc\include\atlconv.h 755
Error 7 error C3861: 'memcpy_s': identifier not found C:\Program Files (x86)\Microsoft Visual Studio 11.0\VC\atlmfc\include\atlconv.h 1250
Error 8 error C3861: 'memcpy_s': identifier not found C:\Program Files (x86)\Microsoft Visual Studio 11.0\VC\atlmfc\include\atlconv.h 1258
Error 9 error C3861: 'memcpy_s': identifier not found C:\Program Files (x86)\Microsoft Visual Studio 11.0\VC\atlmfc\include\atlconv.h 1269
Error 10 error C3861: 'memcpy_s': identifier not found C:\Program Files (x86)\Microsoft Visual Studio 11.0\VC\atlmfc\include\atlconv.h 1288
Error 11 error C3861: 'memcpy_s': identifier not found C:\Program Files (x86)\Microsoft Visual Studio 11.0\VC\atlmfc\include\atlconv.h 1293
Error 12 error C3861: 'memcpy_s': identifier not found C:\Program Files (x86)\Microsoft Visual Studio 11.0\VC\atlmfc\include\atlconv.h 1336
Error 13 error C3861: 'memcpy_s': identifier not found C:\Program Files (x86)\Microsoft Visual Studio 11.0\VC\atlmfc\include\atlconv.h 1341
Error 14 error C3861: 'memcpy_s': identifier not found C:\Program Files (x86)\Microsoft Visual Studio 11.0\VC\atlmfc\include\atlconv.h 1485
Error 15 error C3861: 'memcpy_s': identifier not found C:\Program Files (x86)\Microsoft Visual Studio 11.0\VC\atlmfc\include\atlconv.h 1493
Error 16 error C3861: 'memcpy_s': identifier not found C:\Program Files (x86)\Microsoft Visual Studio 11.0\VC\atlmfc\include\atlconv.h 1504
Error 17 error C2039: 'strcpy_s' : is not a member of '`global namespace'' C:\Program Files (x86)\Microsoft Visual Studio 11.0\VC\atlmfc\include\atlchecked.h 95
Error 18 error C2664: 'AfxCrtErrorCheck' : cannot convert parameter 1 from 'void' to 'errno_t' C:\Program Files (x86)\Microsoft Visual Studio 11.0\VC\atlmfc\include\atlchecked.h 95
Error 19 error C2039: 'wcscpy_s' : is not a member of '`global namespace'' C:\Program Files (x86)\Microsoft Visual Studio 11.0\VC\atlmfc\include\atlchecked.h 103
Error 20 error C2664: 'AfxCrtErrorCheck' : cannot convert parameter 1 from 'void' to 'errno_t' C:\Program Files (x86)\Microsoft Visual Studio 11.0\VC\atlmfc\include\atlchecked.h 103
Error 21 error C2039: 'strcpy_s' : is not a member of '`global namespace'' C:\Program Files (x86)\Microsoft Visual Studio 11.0\VC\atlmfc\include\atlchecked.h 111
Error 22 error C2664: 'AfxCrtErrorCheck' : cannot convert parameter 1 from 'void' to 'errno_t' C:\Program Files (x86)\Microsoft Visual Studio 11.0\VC\atlmfc\include\atlchecked.h 111
Error 23 error C2039: 'strncpy_s' : is not a member of '`global namespace'' C:\Program Files (x86)\Microsoft Visual Studio 11.0\VC\atlmfc\include\atlchecked.h 120
Error 24 error C2039: 'wcsncpy_s' : is not a member of '`global namespace'' C:\Program Files (x86)\Microsoft Visual Studio 11.0\VC\atlmfc\include\atlchecked.h 129
Error 25 error C2039: 'strcat_s' : is not a member of '`global namespace'' C:\Program Files (x86)\Microsoft Visual Studio 11.0\VC\atlmfc\include\atlchecked.h 146
Error 26 error C2664: 'AfxCrtErrorCheck' : cannot convert parameter 1 from 'void' to 'errno_t' C:\Program Files (x86)\Microsoft Visual Studio 11.0\VC\atlmfc\include\atlchecked.h 146
Error 27 error C2039: 'wcscat_s' : is not a member of '`global namespace'' C:\Program Files (x86)\Microsoft Visual Studio 11.0\VC\atlmfc\include\atlchecked.h 154
Error 28 error C2664: 'AfxCrtErrorCheck' : cannot convert parameter 1 from 'void' to 'errno_t' C:\Program Files (x86)\Microsoft Visual Studio 11.0\VC\atlmfc\include\atlchecked.h 154
Error 29 error C2039: 'strcat_s' : is not a member of '`global namespace'' C:\Program Files (x86)\Microsoft Visual Studio 11.0\VC\atlmfc\include\atlchecked.h 162
Error 30 error C2664: 'AfxCrtErrorCheck' : cannot convert parameter 1 from 'void' to 'errno_t' C:\Program Files (x86)\Microsoft Visual Studio 11.0\VC\atlmfc\include\atlchecked.h 162
Error 31 error C2039: '_strlwr_s' : is not a member of '`global namespace'' C:\Program Files (x86)\Microsoft Visual Studio 11.0\VC\atlmfc\include\atlchecked.h 169
Error 32 error C3861: '_strlwr_s': identifier not found C:\Program Files (x86)\Microsoft Visual Studio 11.0\VC\atlmfc\include\atlchecked.h 169
Error 33 error C2039: '_wcslwr_s' : is not a member of '`global namespace'' C:\Program Files (x86)\Microsoft Visual Studio 11.0\VC\atlmfc\include\atlchecked.h 176
Error 34 error C3861: '_wcslwr_s': identifier not found C:\Program Files (x86)\Microsoft Visual Studio 11.0\VC\atlmfc\include\atlchecked.h 176
Error 35 error C2039: '_strupr_s' : is not a member of '`global namespace'' C:\Program Files (x86)\Microsoft Visual Studio 11.0\VC\atlmfc\include\atlchecked.h 199
Error 36 error C3861: '_strupr_s': identifier not found C:\Program Files (x86)\Microsoft Visual Studio 11.0\VC\atlmfc\include\atlchecked.h 199
Error 37 error C2039: '_wcsupr_s' : is not a member of '`global namespace'' C:\Program Files (x86)\Microsoft Visual Studio 11.0\VC\atlmfc\include\atlchecked.h 206
Error 38 error C3861: '_wcsupr_s': identifier not found C:\Program Files (x86)\Microsoft Visual Studio 11.0\VC\atlmfc\include\atlchecked.h 206
Error 39 error C2039: 'strnlen' : is not a member of '`global namespace'' C:\Program Files (x86)\Microsoft Visual Studio 11.0\VC\atlmfc\include\atlchecked.h 362
Error 40 error C2039: 'wcsnlen' : is not a member of '`global namespace'' C:\Program Files (x86)\Microsoft Visual Studio 11.0\VC\atlmfc\include\atlchecked.h 369
Error 41 error C2039: 'strnlen' : is not a member of '`global namespace'' C:\Program Files (x86)\Microsoft Visual Studio 11.0\VC\atlmfc\include\atlchecked.h 376
Error 42 error C3861: 'wcscat_s': identifier not found C:\Program Files (x86)\Microsoft Visual Studio 11.0\VC\atlmfc\include\atlcore.h 642
Error 43 error C3861: 'wcscat_s': identifier not found C:\Program Files (x86)\Microsoft Visual Studio 11.0\VC\atlmfc\include\atlcore.h 648
Error 44 error C3861: '_wcsupr_s': identifier not found C:\Program Files (x86)\Microsoft Visual Studio 11.0\VC\atlmfc\include\cstringt.h 650
Error 45 error C3861: '_wcslwr_s': identifier not found C:\Program Files (x86)\Microsoft Visual Studio 11.0\VC\atlmfc\include\cstringt.h 658
Error 68 error C2146: syntax error : missing ';' before identifier 'pixelFormat' C:\Program Files (x86)\Windows Kits\8.0\Include\um\d2d1.h 329
Error 69 error C4430: missing type specifier - int assumed. Note: C++ does not support default-int C:\Program Files (x86)\Windows Kits\8.0\Include\um\d2d1.h 329
Error 70 error C2146: syntax error : missing ';' before identifier 'pixelFormat' C:\Program Files (x86)\Windows Kits\8.0\Include\um\d2d1.h 1048
Error 71 error C4430: missing type specifier - int assumed. Note: C++ does not support default-int C:\Program Files (x86)\Windows Kits\8.0\Include\um\d2d1.h 1048
Error 72 error C2059: syntax error : 'string' C:\Program Files (x86)\Windows Kits\8.0\Include\um\d2d1.h 1230
Error 73 error C2059: syntax error : 'public' C:\Program Files (x86)\Windows Kits\8.0\Include\um\d2d1.h 1230
Error 74 error C2143: syntax error : missing ';' before '{' C:\Program Files (x86)\Windows Kits\8.0\Include\um\d2d1.h 1231
Error 75 error C2447: '{' : missing function header (old-style formal list?) C:\Program Files (x86)\Windows Kits\8.0\Include\um\d2d1.h 1231
Error 76 error C2059: syntax error : 'string' C:\Program Files (x86)\Windows Kits\8.0\Include\um\d2d1.h 1250
Error 77 error C2059: syntax error : 'public' C:\Program Files (x86)\Windows Kits\8.0\Include\um\d2d1.h 1250
Error 78 error C2143: syntax error : missing ';' before '{' C:\Program Files (x86)\Windows Kits\8.0\Include\um\d2d1.h 1251
Error 79 error C2447: '{' : missing function header (old-style formal list?) C:\Program Files (x86)\Windows Kits\8.0\Include\um\d2d1.h 1251
Error 80 error C2059: syntax error : 'string' C:\Program Files (x86)\Windows Kits\8.0\Include\um\d2d1.h 1265
Error 81 error C2059: syntax error : 'public' C:\Program Files (x86)\Windows Kits\8.0\Include\um\d2d1.h 1265
Error 82 error C2143: syntax error : missing ';' before '{' C:\Program Files (x86)\Windows Kits\8.0\Include\um\d2d1.h 1266
Error 83 error C2447: '{' : missing function header (old-style formal list?) C:\Program Files (x86)\Windows Kits\8.0\Include\um\d2d1.h 1266
Error 84 error C2059: syntax error : 'string' C:\Program Files (x86)\Windows Kits\8.0\Include\um\d2d1.h 1329
Error 85 error C2059: syntax error : 'public' C:\Program Files (x86)\Windows Kits\8.0\Include\um\d2d1.h 1329
Error 86 error C2143: syntax error : missing ';' before '{' C:\Program Files (x86)\Windows Kits\8.0\Include\um\d2d1.h 1330
Error 87 error C2447: '{' : missing function header (old-style formal list?) C:\Program Files (x86)\Windows Kits\8.0\Include\um\d2d1.h 1330
Error 88 error C2059: syntax error : 'string' C:\Program Files (x86)\Windows Kits\8.0\Include\um\d2d1.h 1371
Error 89 error C2059: syntax error : 'public' C:\Program Files (x86)\Windows Kits\8.0\Include\um\d2d1.h 1371
Error 90 error C2143: syntax error : missing ';' before '{' C:\Program Files (x86)\Windows Kits\8.0\Include\um\d2d1.h 1372
Error 91 error C2447: '{' : missing function header (old-style formal list?) C:\Program Files (x86)\Windows Kits\8.0\Include\um\d2d1.h 1372
Error 92 error C2059: syntax error : 'string' C:\Program Files (x86)\Windows Kits\8.0\Include\um\d2d1.h 1417
Error 93 error C2059: syntax error : 'public' C:\Program Files (x86)\Windows Kits\8.0\Include\um\d2d1.h 1417
Error 94 error C2143: syntax error : missing ';' before '{' C:\Program Files (x86)\Windows Kits\8.0\Include\um\d2d1.h 1418
Error 95 error C2447: '{' : missing function header (old-style formal list?) C:\Program Files (x86)\Windows Kits\8.0\Include\um\d2d1.h 1418
Error 96 error C2059: syntax error : 'string' C:\Program Files (x86)\Windows Kits\8.0\Include\um\d2d1.h 1476
Error 97 error C2059: syntax error : 'public' C:\Program Files (x86)\Windows Kits\8.0\Include\um\d2d1.h 1476
Error 98 error C2143: syntax error : missing ';' before '{' C:\Program Files (x86)\Windows Kits\8.0\Include\um\d2d1.h 1477
Error 99 error C2447: '{' : missing function header (old-style formal list?) C:\Program Files (x86)\Windows Kits\8.0\Include\um\d2d1.h 1477
Error 100 error C2059: syntax error : 'string' C:\Program Files (x86)\Windows Kits\8.0\Include\um\d2d1.h 1503
Error 101 error C2059: syntax error : 'public' C:\Program Files (x86)\Windows Kits\8.0\Include\um\d2d1.h 1503
Error 102 error C2143: syntax error : missing ';' before '{' C:\Program Files (x86)\Windows Kits\8.0\Include\um\d2d1.h 1504
Error 103 error C2447: '{' : missing function header (old-style formal list?) C:\Program Files (x86)\Windows Kits\8.0\Include\um\d2d1.h 1504
Error 104 error C2059: syntax error : 'string' C:\Program Files (x86)\Windows Kits\8.0\Include\um\d2d1.h 1538
Error 105 error C2059: syntax error : 'public' C:\Program Files (x86)\Windows Kits\8.0\Include\um\d2d1.h 1538
Error 106 error C2143: syntax error : missing ';' before '{' C:\Program Files (x86)\Windows Kits\8.0\Include\um\d2d1.h 1539
Error 107 error C2447: '{' : missing function header (old-style formal list?) C:\Program Files (x86)\Windows Kits\8.0\Include\um\d2d1.h 1539
Error 108 error C2059: syntax error : 'string' C:\Program Files (x86)\Windows Kits\8.0\Include\um\d2d1.h 1594
Error 109 error C2059: syntax error : 'public' C:\Program Files (x86)\Windows Kits\8.0\Include\um\d2d1.h 1594
Error 110 error C2143: syntax error : missing ';' before '{' C:\Program Files (x86)\Windows Kits\8.0\Include\um\d2d1.h 1595
Error 111 error C2447: '{' : missing function header (old-style formal list?) C:\Program Files (x86)\Windows Kits\8.0\Include\um\d2d1.h 1595
Error 112 error C2059: syntax error : 'string' C:\Program Files (x86)\Windows Kits\8.0\Include\um\d2d1.h 1640
Error 113 error C2059: syntax error : 'public' C:\Program Files (x86)\Windows Kits\8.0\Include\um\d2d1.h 1640
Error 114 error C2143: syntax error : missing ';' before '{' C:\Program Files (x86)\Windows Kits\8.0\Include\um\d2d1.h 1641
Error 115 error C2447: '{' : missing function header (old-style formal list?) C:\Program Files (x86)\Windows Kits\8.0\Include\um\d2d1.h 1641
Error 116 error C2059: syntax error : 'string' C:\Program Files (x86)\Windows Kits\8.0\Include\um\d2d1.h 2332
Error 117 error C2059: syntax error : 'public' C:\Program Files (x86)\Windows Kits\8.0\Include\um\d2d1.h 2332
Error 118 error C2143: syntax error : missing ';' before '{' C:\Program Files (x86)\Windows Kits\8.0\Include\um\d2d1.h 2333
Error 119 error C2447: '{' : missing function header (old-style formal list?) C:\Program Files (x86)\Windows Kits\8.0\Include\um\d2d1.h 2333
Error 120 error C2059: syntax error : 'string' C:\Program Files (x86)\Windows Kits\8.0\Include\um\d2d1.h 2348
Error 121 error C2059: syntax error : 'public' C:\Program Files (x86)\Windows Kits\8.0\Include\um\d2d1.h 2348
Error 122 error C2143: syntax error : missing ';' before '{' C:\Program Files (x86)\Windows Kits\8.0\Include\um\d2d1.h 2349
Error 123 error C2447: '{' : missing function header (old-style formal list?) C:\Program Files (x86)\Windows Kits\8.0\Include\um\d2d1.h 2349
Error 124 error C2059: syntax error : 'string' C:\Program Files (x86)\Windows Kits\8.0\Include\um\d2d1.h 2364
Error 125 error C2059: syntax error : 'public' C:\Program Files (x86)\Windows Kits\8.0\Include\um\d2d1.h 2364
Error 126 error C2143: syntax error : missing ';' before '{' C:\Program Files (x86)\Windows Kits\8.0\Include\um\d2d1.h 2365
Error 127 error C2447: '{' : missing function header (old-style formal list?) C:\Program Files (x86)\Windows Kits\8.0\Include\um\d2d1.h 2365
Error 128 error C1003: error count exceeds 100; stopping compilation C:\Program Files (x86)\Windows Kits\8.0\Include\um\d2d1.h 2365
Error 139 error LNK1201: error writing to program database 'C:\Users\Coding-Team\Desktop\FlyffService\Files to Update\Program\WorldServer.pdb'; check for insufficient disk space, invalid path, or insufficient privilege C:\Users\furzi\Desktop\SERVER\Source\WorldServer\LINK
UPDATE: Only the neuz is not compiling right now, but still has the problem of the other executables when opened it will close eventually after a wile.
Hi people, I have installed VS 2012 Ultimate, I can compile successfully all the executables except for Neuz and WorldServer. Did I miss anything? I really need help with this.
Also when I open the certifier.exe after the accountserver, it will be opened but is not responding and will eventually crash after a while what could be the problem?
Error 1 error C2146: syntax error : missing ';' before identifier 'PVOID64' C:\Program Files (x86)\Windows Kits\8.0\Include\um\winnt.h 301
Error 2 error C4430: missing type specifier - int assumed. Note: C++ does not support default-int C:\Program Files (x86)\Windows Kits\8.0\Include\um\winnt.h 301
Error 3 error C2146: syntax error : missing ';' before identifier 'Buffer' C:\Program Files (x86)\Windows Kits\8.0\Include\um\winnt.h 11698
Error 4 error C4430: missing type specifier - int assumed. Note: C++ does not support default-int C:\Program Files (x86)\Windows Kits\8.0\Include\um\winnt.h 11698
Error 5 error C3861: 'memcpy_s': identifier not found C:\Program Files (x86)\Microsoft Visual Studio 11.0\VC\atlmfc\include\atlconv.h 746
Error 6 error C3861: 'wcscat_s': identifier not found C:\Program Files (x86)\Microsoft Visual Studio 11.0\VC\atlmfc\include\atlconv.h 755
Error 7 error C3861: 'memcpy_s': identifier not found C:\Program Files (x86)\Microsoft Visual Studio 11.0\VC\atlmfc\include\atlconv.h 1250
Error 8 error C3861: 'memcpy_s': identifier not found C:\Program Files (x86)\Microsoft Visual Studio 11.0\VC\atlmfc\include\atlconv.h 1258
Error 9 error C3861: 'memcpy_s': identifier not found C:\Program Files (x86)\Microsoft Visual Studio 11.0\VC\atlmfc\include\atlconv.h 1269
Error 10 error C3861: 'memcpy_s': identifier not found C:\Program Files (x86)\Microsoft Visual Studio 11.0\VC\atlmfc\include\atlconv.h 1288
Error 11 error C3861: 'memcpy_s': identifier not found C:\Program Files (x86)\Microsoft Visual Studio 11.0\VC\atlmfc\include\atlconv.h 1293
Error 12 error C3861: 'memcpy_s': identifier not found C:\Program Files (x86)\Microsoft Visual Studio 11.0\VC\atlmfc\include\atlconv.h 1336
Error 13 error C3861: 'memcpy_s': identifier not found C:\Program Files (x86)\Microsoft Visual Studio 11.0\VC\atlmfc\include\atlconv.h 1341
Error 14 error C3861: 'memcpy_s': identifier not found C:\Program Files (x86)\Microsoft Visual Studio 11.0\VC\atlmfc\include\atlconv.h 1485
Error 15 error C3861: 'memcpy_s': identifier not found C:\Program Files (x86)\Microsoft Visual Studio 11.0\VC\atlmfc\include\atlconv.h 1493
Error 16 error C3861: 'memcpy_s': identifier not found C:\Program Files (x86)\Microsoft Visual Studio 11.0\VC\atlmfc\include\atlconv.h 1504
Error 17 error C2039: 'strcpy_s' : is not a member of '`global namespace'' C:\Program Files (x86)\Microsoft Visual Studio 11.0\VC\atlmfc\include\atlchecked.h 95
Error 18 error C2664: 'AfxCrtErrorCheck' : cannot convert parameter 1 from 'void' to 'errno_t' C:\Program Files (x86)\Microsoft Visual Studio 11.0\VC\atlmfc\include\atlchecked.h 95
Error 19 error C2039: 'wcscpy_s' : is not a member of '`global namespace'' C:\Program Files (x86)\Microsoft Visual Studio 11.0\VC\atlmfc\include\atlchecked.h 103
Error 20 error C2664: 'AfxCrtErrorCheck' : cannot convert parameter 1 from 'void' to 'errno_t' C:\Program Files (x86)\Microsoft Visual Studio 11.0\VC\atlmfc\include\atlchecked.h 103
Error 21 error C2039: 'strcpy_s' : is not a member of '`global namespace'' C:\Program Files (x86)\Microsoft Visual Studio 11.0\VC\atlmfc\include\atlchecked.h 111
Error 22 error C2664: 'AfxCrtErrorCheck' : cannot convert parameter 1 from 'void' to 'errno_t' C:\Program Files (x86)\Microsoft Visual Studio 11.0\VC\atlmfc\include\atlchecked.h 111
Error 23 error C2039: 'strncpy_s' : is not a member of '`global namespace'' C:\Program Files (x86)\Microsoft Visual Studio 11.0\VC\atlmfc\include\atlchecked.h 120
Error 24 error C2039: 'wcsncpy_s' : is not a member of '`global namespace'' C:\Program Files (x86)\Microsoft Visual Studio 11.0\VC\atlmfc\include\atlchecked.h 129
Error 25 error C2039: 'strcat_s' : is not a member of '`global namespace'' C:\Program Files (x86)\Microsoft Visual Studio 11.0\VC\atlmfc\include\atlchecked.h 146
Error 26 error C2664: 'AfxCrtErrorCheck' : cannot convert parameter 1 from 'void' to 'errno_t' C:\Program Files (x86)\Microsoft Visual Studio 11.0\VC\atlmfc\include\atlchecked.h 146
Error 27 error C2039: 'wcscat_s' : is not a member of '`global namespace'' C:\Program Files (x86)\Microsoft Visual Studio 11.0\VC\atlmfc\include\atlchecked.h 154
Error 28 error C2664: 'AfxCrtErrorCheck' : cannot convert parameter 1 from 'void' to 'errno_t' C:\Program Files (x86)\Microsoft Visual Studio 11.0\VC\atlmfc\include\atlchecked.h 154
Error 29 error C2039: 'strcat_s' : is not a member of '`global namespace'' C:\Program Files (x86)\Microsoft Visual Studio 11.0\VC\atlmfc\include\atlchecked.h 162
Error 30 error C2664: 'AfxCrtErrorCheck' : cannot convert parameter 1 from 'void' to 'errno_t' C:\Program Files (x86)\Microsoft Visual Studio 11.0\VC\atlmfc\include\atlchecked.h 162
Error 31 error C2039: '_strlwr_s' : is not a member of '`global namespace'' C:\Program Files (x86)\Microsoft Visual Studio 11.0\VC\atlmfc\include\atlchecked.h 169
Error 32 error C3861: '_strlwr_s': identifier not found C:\Program Files (x86)\Microsoft Visual Studio 11.0\VC\atlmfc\include\atlchecked.h 169
Error 33 error C2039: '_wcslwr_s' : is not a member of '`global namespace'' C:\Program Files (x86)\Microsoft Visual Studio 11.0\VC\atlmfc\include\atlchecked.h 176
Error 34 error C3861: '_wcslwr_s': identifier not found C:\Program Files (x86)\Microsoft Visual Studio 11.0\VC\atlmfc\include\atlchecked.h 176
Error 35 error C2039: '_strupr_s' : is not a member of '`global namespace'' C:\Program Files (x86)\Microsoft Visual Studio 11.0\VC\atlmfc\include\atlchecked.h 199
Error 36 error C3861: '_strupr_s': identifier not found C:\Program Files (x86)\Microsoft Visual Studio 11.0\VC\atlmfc\include\atlchecked.h 199
Error 37 error C2039: '_wcsupr_s' : is not a member of '`global namespace'' C:\Program Files (x86)\Microsoft Visual Studio 11.0\VC\atlmfc\include\atlchecked.h 206
Error 38 error C3861: '_wcsupr_s': identifier not found C:\Program Files (x86)\Microsoft Visual Studio 11.0\VC\atlmfc\include\atlchecked.h 206
Error 39 error C2039: 'strnlen' : is not a member of '`global namespace'' C:\Program Files (x86)\Microsoft Visual Studio 11.0\VC\atlmfc\include\atlchecked.h 362
Error 40 error C2039: 'wcsnlen' : is not a member of '`global namespace'' C:\Program Files (x86)\Microsoft Visual Studio 11.0\VC\atlmfc\include\atlchecked.h 369
Error 41 error C2039: 'strnlen' : is not a member of '`global namespace'' C:\Program Files (x86)\Microsoft Visual Studio 11.0\VC\atlmfc\include\atlchecked.h 376
Error 42 error C3861: 'wcscat_s': identifier not found C:\Program Files (x86)\Microsoft Visual Studio 11.0\VC\atlmfc\include\atlcore.h 642
Error 43 error C3861: 'wcscat_s': identifier not found C:\Program Files (x86)\Microsoft Visual Studio 11.0\VC\atlmfc\include\atlcore.h 648
Error 44 error C3861: '_wcsupr_s': identifier not found C:\Program Files (x86)\Microsoft Visual Studio 11.0\VC\atlmfc\include\cstringt.h 650
Error 45 error C3861: '_wcslwr_s': identifier not found C:\Program Files (x86)\Microsoft Visual Studio 11.0\VC\atlmfc\include\cstringt.h 658
Error 68 error C2146: syntax error : missing ';' before identifier 'pixelFormat' C:\Program Files (x86)\Windows Kits\8.0\Include\um\d2d1.h 329
Error 69 error C4430: missing type specifier - int assumed. Note: C++ does not support default-int C:\Program Files (x86)\Windows Kits\8.0\Include\um\d2d1.h 329
Error 70 error C2146: syntax error : missing ';' before identifier 'pixelFormat' C:\Program Files (x86)\Windows Kits\8.0\Include\um\d2d1.h 1048
Error 71 error C4430: missing type specifier - int assumed. Note: C++ does not support default-int C:\Program Files (x86)\Windows Kits\8.0\Include\um\d2d1.h 1048
Error 72 error C2059: syntax error : 'string' C:\Program Files (x86)\Windows Kits\8.0\Include\um\d2d1.h 1230
Error 73 error C2059: syntax error : 'public' C:\Program Files (x86)\Windows Kits\8.0\Include\um\d2d1.h 1230
Error 74 error C2143: syntax error : missing ';' before '{' C:\Program Files (x86)\Windows Kits\8.0\Include\um\d2d1.h 1231
Error 75 error C2447: '{' : missing function header (old-style formal list?) C:\Program Files (x86)\Windows Kits\8.0\Include\um\d2d1.h 1231
Error 76 error C2059: syntax error : 'string' C:\Program Files (x86)\Windows Kits\8.0\Include\um\d2d1.h 1250
Error 77 error C2059: syntax error : 'public' C:\Program Files (x86)\Windows Kits\8.0\Include\um\d2d1.h 1250
Error 78 error C2143: syntax error : missing ';' before '{' C:\Program Files (x86)\Windows Kits\8.0\Include\um\d2d1.h 1251
Error 79 error C2447: '{' : missing function header (old-style formal list?) C:\Program Files (x86)\Windows Kits\8.0\Include\um\d2d1.h 1251
Error 80 error C2059: syntax error : 'string' C:\Program Files (x86)\Windows Kits\8.0\Include\um\d2d1.h 1265
Error 81 error C2059: syntax error : 'public' C:\Program Files (x86)\Windows Kits\8.0\Include\um\d2d1.h 1265
Error 82 error C2143: syntax error : missing ';' before '{' C:\Program Files (x86)\Windows Kits\8.0\Include\um\d2d1.h 1266
Error 83 error C2447: '{' : missing function header (old-style formal list?) C:\Program Files (x86)\Windows Kits\8.0\Include\um\d2d1.h 1266
Error 84 error C2059: syntax error : 'string' C:\Program Files (x86)\Windows Kits\8.0\Include\um\d2d1.h 1329
Error 85 error C2059: syntax error : 'public' C:\Program Files (x86)\Windows Kits\8.0\Include\um\d2d1.h 1329
Error 86 error C2143: syntax error : missing ';' before '{' C:\Program Files (x86)\Windows Kits\8.0\Include\um\d2d1.h 1330
Error 87 error C2447: '{' : missing function header (old-style formal list?) C:\Program Files (x86)\Windows Kits\8.0\Include\um\d2d1.h 1330
Error 88 error C2059: syntax error : 'string' C:\Program Files (x86)\Windows Kits\8.0\Include\um\d2d1.h 1371
Error 89 error C2059: syntax error : 'public' C:\Program Files (x86)\Windows Kits\8.0\Include\um\d2d1.h 1371
Error 90 error C2143: syntax error : missing ';' before '{' C:\Program Files (x86)\Windows Kits\8.0\Include\um\d2d1.h 1372
Error 91 error C2447: '{' : missing function header (old-style formal list?) C:\Program Files (x86)\Windows Kits\8.0\Include\um\d2d1.h 1372
Error 92 error C2059: syntax error : 'string' C:\Program Files (x86)\Windows Kits\8.0\Include\um\d2d1.h 1417
Error 93 error C2059: syntax error : 'public' C:\Program Files (x86)\Windows Kits\8.0\Include\um\d2d1.h 1417
Error 94 error C2143: syntax error : missing ';' before '{' C:\Program Files (x86)\Windows Kits\8.0\Include\um\d2d1.h 1418
Error 95 error C2447: '{' : missing function header (old-style formal list?) C:\Program Files (x86)\Windows Kits\8.0\Include\um\d2d1.h 1418
Error 96 error C2059: syntax error : 'string' C:\Program Files (x86)\Windows Kits\8.0\Include\um\d2d1.h 1476
Error 97 error C2059: syntax error : 'public' C:\Program Files (x86)\Windows Kits\8.0\Include\um\d2d1.h 1476
Error 98 error C2143: syntax error : missing ';' before '{' C:\Program Files (x86)\Windows Kits\8.0\Include\um\d2d1.h 1477
Error 99 error C2447: '{' : missing function header (old-style formal list?) C:\Program Files (x86)\Windows Kits\8.0\Include\um\d2d1.h 1477
Error 100 error C2059: syntax error : 'string' C:\Program Files (x86)\Windows Kits\8.0\Include\um\d2d1.h 1503
Error 101 error C2059: syntax error : 'public' C:\Program Files (x86)\Windows Kits\8.0\Include\um\d2d1.h 1503
Error 102 error C2143: syntax error : missing ';' before '{' C:\Program Files (x86)\Windows Kits\8.0\Include\um\d2d1.h 1504
Error 103 error C2447: '{' : missing function header (old-style formal list?) C:\Program Files (x86)\Windows Kits\8.0\Include\um\d2d1.h 1504
Error 104 error C2059: syntax error : 'string' C:\Program Files (x86)\Windows Kits\8.0\Include\um\d2d1.h 1538
Error 105 error C2059: syntax error : 'public' C:\Program Files (x86)\Windows Kits\8.0\Include\um\d2d1.h 1538
Error 106 error C2143: syntax error : missing ';' before '{' C:\Program Files (x86)\Windows Kits\8.0\Include\um\d2d1.h 1539
Error 107 error C2447: '{' : missing function header (old-style formal list?) C:\Program Files (x86)\Windows Kits\8.0\Include\um\d2d1.h 1539
Error 108 error C2059: syntax error : 'string' C:\Program Files (x86)\Windows Kits\8.0\Include\um\d2d1.h 1594
Error 109 error C2059: syntax error : 'public' C:\Program Files (x86)\Windows Kits\8.0\Include\um\d2d1.h 1594
Error 110 error C2143: syntax error : missing ';' before '{' C:\Program Files (x86)\Windows Kits\8.0\Include\um\d2d1.h 1595
Error 111 error C2447: '{' : missing function header (old-style formal list?) C:\Program Files (x86)\Windows Kits\8.0\Include\um\d2d1.h 1595
Error 112 error C2059: syntax error : 'string' C:\Program Files (x86)\Windows Kits\8.0\Include\um\d2d1.h 1640
Error 113 error C2059: syntax error : 'public' C:\Program Files (x86)\Windows Kits\8.0\Include\um\d2d1.h 1640
Error 114 error C2143: syntax error : missing ';' before '{' C:\Program Files (x86)\Windows Kits\8.0\Include\um\d2d1.h 1641
Error 115 error C2447: '{' : missing function header (old-style formal list?) C:\Program Files (x86)\Windows Kits\8.0\Include\um\d2d1.h 1641
Error 116 error C2059: syntax error : 'string' C:\Program Files (x86)\Windows Kits\8.0\Include\um\d2d1.h 2332
Error 117 error C2059: syntax error : 'public' C:\Program Files (x86)\Windows Kits\8.0\Include\um\d2d1.h 2332
Error 118 error C2143: syntax error : missing ';' before '{' C:\Program Files (x86)\Windows Kits\8.0\Include\um\d2d1.h 2333
Error 119 error C2447: '{' : missing function header (old-style formal list?) C:\Program Files (x86)\Windows Kits\8.0\Include\um\d2d1.h 2333
Error 120 error C2059: syntax error : 'string' C:\Program Files (x86)\Windows Kits\8.0\Include\um\d2d1.h 2348
Error 121 error C2059: syntax error : 'public' C:\Program Files (x86)\Windows Kits\8.0\Include\um\d2d1.h 2348
Error 122 error C2143: syntax error : missing ';' before '{' C:\Program Files (x86)\Windows Kits\8.0\Include\um\d2d1.h 2349
Error 123 error C2447: '{' : missing function header (old-style formal list?) C:\Program Files (x86)\Windows Kits\8.0\Include\um\d2d1.h 2349
Error 124 error C2059: syntax error : 'string' C:\Program Files (x86)\Windows Kits\8.0\Include\um\d2d1.h 2364
Error 125 error C2059: syntax error : 'public' C:\Program Files (x86)\Windows Kits\8.0\Include\um\d2d1.h 2364
Error 126 error C2143: syntax error : missing ';' before '{' C:\Program Files (x86)\Windows Kits\8.0\Include\um\d2d1.h 2365
Error 127 error C2447: '{' : missing function header (old-style formal list?) C:\Program Files (x86)\Windows Kits\8.0\Include\um\d2d1.h 2365
Error 128 error C1003: error count exceeds 100; stopping compilation C:\Program Files (x86)\Windows Kits\8.0\Include\um\d2d1.h 2365
Error 139 error LNK1201: error writing to program database 'C:\Users\Coding-Team\Desktop\FlyffService\Files to Update\Program\WorldServer.pdb'; check for insufficient disk space, invalid path, or insufficient privilege C:\Users\furzi\Desktop\SERVER\Source\WorldServer\LINK
UPDATE: Only the neuz is not compiling right now, but still has the problem of the other executables when opened it will close eventually after a wile.