Register for your free account! | Forgot your password?

You last visited: Today at 23:15

  • Please register to post and access all features, it's quick, easy and FREE!

 

Kompilieren Error

Reply
 
Old   #1
 
elite*gold: 0
Join Date: Jun 2009
Posts: 12
Received Thanks: 1
Kompilieren Error

Hallo

Ich bekomme bei jeden TrinityCore den gleichen fehler beim kompilieren.

Der kommt bei 7 %, der sieht so aus:

Code:
[  7%] Building CXX object src/server/shared/CMakeFiles/shared_pch_dephelp.dir/s                                                                                                 hared_pch_dephelp.cxx.o
In file included from /home/trinity/TrinityCore/src/server/shared/Threading/Lock                                                                                                 edQueue.h:26,
                 from /home/trinity/TrinityCore/src/server/shared/Common.h:88,
                 from /home/trinity/TrinityCore/src/server/shared/PrecompiledHea                                                                                                 ders/sharedPCH.h:3,
                 from /home/trinity/TrinityCore/src/server/shared/shared_pch_dep                                                                                                 help.cxx:1:
/home/trinity/TrinityCore/src/server/shared/Debugging/Errors.h:24:29: error: ace                                                                                                 /Stack_Trace.h: No such file or directory
In file included from /home/trinity/TrinityCore/src/server/shared/Database/SQLOp                                                                                                 eration.h:24,
                 from /home/trinity/TrinityCore/src/server/shared/PrecompiledHea                                                                                                 ders/sharedPCH.h:6,
                 from /home/trinity/TrinityCore/src/server/shared/shared_pch_dep                                                                                                 help.cxx:1:
/home/trinity/TrinityCore/src/server/shared/Database/QueryResult.h: In member fu                                                                                                 nction 'const Field& ResultSet::operator[](uint32) const':
/home/trinity/TrinityCore/src/server/shared/Database/QueryResult.h:46: error: 'A                                                                                                 CE_Stack_Trace' was not declared in this scope
/home/trinity/TrinityCore/src/server/shared/Database/QueryResult.h:46: error: ex                                                                                                 pected `;' before 'st'
/home/trinity/TrinityCore/src/server/shared/Database/QueryResult.h:46: error: 's                                                                                                 t' was not declared in this scope
/home/trinity/TrinityCore/src/server/shared/Database/QueryResult.h: In member fu                                                                                                 nction 'Field* PreparedResultSet::Fetch() const':
/home/trinity/TrinityCore/src/server/shared/Database/QueryResult.h:75: error: 'A                                                                                                 CE_Stack_Trace' was not declared in this scope
/home/trinity/TrinityCore/src/server/shared/Database/QueryResult.h:75: error: ex                                                                                                 pected `;' before 'st'
/home/trinity/TrinityCore/src/server/shared/Database/QueryResult.h:75: error: 's                                                                                                 t' was not declared in this scope
/home/trinity/TrinityCore/src/server/shared/Database/QueryResult.h: In member fu                                                                                                 nction 'const Field& PreparedResultSet::operator[](uint32) const':
/home/trinity/TrinityCore/src/server/shared/Database/QueryResult.h:81: error: 'A                                                                                                 CE_Stack_Trace' was not declared in this scope
/home/trinity/TrinityCore/src/server/shared/Database/QueryResult.h:81: error: ex                                                                                                 pected `;' before 'st'
/home/trinity/TrinityCore/src/server/shared/Database/QueryResult.h:81: error: 's                                                                                                 t' was not declared in this scope
/home/trinity/TrinityCore/src/server/shared/Database/QueryResult.h:82: error: 'A                                                                                                 CE_Stack_Trace' was not declared in this scope
/home/trinity/TrinityCore/src/server/shared/Database/QueryResult.h:82: error: ex                                                                                                 pected `;' before 'st'
/home/trinity/TrinityCore/src/server/shared/Database/QueryResult.h:82: error: 's                                                                                                 t' was not declared in this scope
make[2]: *** [src/server/shared/CMakeFiles/shared_pch_dephelp.dir/shared_pch_dep                                                                                                 help.cxx.o] Error 1
make[1]: *** [src/server/shared/CMakeFiles/shared_pch_dephelp.dir/all] Error 2
make: *** [all] Error 2

oder

Code:
[  7%] Building CXX object src/server/shared/CMakeFiles/shared_pch_dephelp.dir/shared_pch_dephelp.cxx.o
In file included from /home/trinity/MMOCore_Test/src/server/shared/Threading/LockedQueue.h:26,
                 from /home/trinity/MMOCore_Test/src/server/shared/Common.h:88,
                 from /home/trinity/MMOCore_Test/src/server/shared/PrecompiledHeaders/sharedPCH.h:3,
                 from /home/trinity/MMOCore_Test/src/server/shared/shared_pch_dephelp.cxx:1:
/home/trinity/MMOCore_Test/src/server/shared/Debugging/Errors.h:24:29: error: ace/Stack_Trace.h: No such file or directory
In file included from /home/trinity/MMOCore_Test/src/server/shared/Database/SQLOperation.h:24,
                 from /home/trinity/MMOCore_Test/src/server/shared/PrecompiledHeaders/sharedPCH.h:6,
                 from /home/trinity/MMOCore_Test/src/server/shared/shared_pch_dephelp.cxx:1:
/home/trinity/MMOCore_Test/src/server/shared/Database/QueryResult.h: In member function 'const Field& ResultSet::operator[](uint32) const':
/home/trinity/MMOCore_Test/src/server/shared/Database/QueryResult.h:46: error: 'ACE_Stack_Trace' was not declared in this scope
/home/trinity/MMOCore_Test/src/server/shared/Database/QueryResult.h:46: error: expected `;' before 'st'
/home/trinity/MMOCore_Test/src/server/shared/Database/QueryResult.h:46: error: 'st' was not declared in this scope
/home/trinity/MMOCore_Test/src/server/shared/Database/QueryResult.h: In member function 'Field* PreparedResultSet::Fetch() const':
/home/trinity/MMOCore_Test/src/server/shared/Database/QueryResult.h:75: error: 'ACE_Stack_Trace' was not declared in this scope
/home/trinity/MMOCore_Test/src/server/shared/Database/QueryResult.h:75: error: expected `;' before 'st'
/home/trinity/MMOCore_Test/src/server/shared/Database/QueryResult.h:75: error: 'st' was not declared in this scope
/home/trinity/MMOCore_Test/src/server/shared/Database/QueryResult.h: In member function 'const Field& PreparedResultSet::operator[](uint32) const':
/home/trinity/MMOCore_Test/src/server/shared/Database/QueryResult.h:81: error: 'ACE_Stack_Trace' was not declared in this scope
/home/trinity/MMOCore_Test/src/server/shared/Database/QueryResult.h:81: error: expected `;' before 'st'
/home/trinity/MMOCore_Test/src/server/shared/Database/QueryResult.h:81: error: 'st' was not declared in this scope
/home/trinity/MMOCore_Test/src/server/shared/Database/QueryResult.h:82: error: 'ACE_Stack_Trace' was not declared in this scope
/home/trinity/MMOCore_Test/src/server/shared/Database/QueryResult.h:82: error: expected `;' before 'st'
/home/trinity/MMOCore_Test/src/server/shared/Database/QueryResult.h:82: error: 'st' was not declared in this scope
make[2]: *** [src/server/shared/CMakeFiles/shared_pch_dephelp.dir/shared_pch_dephelp.cxx.o] Error 1
make[1]: *** [src/server/shared/CMakeFiles/shared_pch_dephelp.dir/all] Error 2
make: *** [all] Error 2
Weiss einer vieleicht warum das immer kommt?

MFG:

b4nan1



b4nan1 is offline  
Old   #2
 
elite*gold: 0
Join Date: Aug 2011
Posts: 93
Received Thanks: 38
Hoffe der Link hilft.



LG M.


PartyIsOver is offline  
Reply



« Previous Thread | Next Thread »

Similar Threads
Source Kompilieren Error
Hey, Hab den MAX_MONSTER_LEVEL Error wegbeommen, doch hab jetzt neue :/ D:\FlyForFun\Sourcecode\V15\Clean Source\Official...
8 Replies - Flyff PServer - Discussions / Questions
[Linux] ArcEmu kompilieren
Anleitung zum kompilieren von ArcEmu ArcEmu ist ein Emulator für das Spiel "World of Warcraft". 1. Benötigte Programme installieren
3 Replies - Tutorials
[Windows] MaNGOS kompilieren
Anleitung zum kompilieren von MaNGOS MaNGOS ist ein Emulator für das Spiel "World of Warcraft". 1. Benötigte Programme installieren (Wir...
4 Replies - Tutorials
[Linux] MaNGOS kompilieren
Anleitung zum kompilieren von MaNGOS MaNGOS ist ein Emulator für das Spiel "World of Warcraft". 1. Benötigte Programme installieren ...
1 Replies - Tutorials
[VB]Kompilieren
Moin, kann mir jemand erklären wie ich in VB 2010 Express mein Projekt in eine .exe Kompilieren kann? Die Exe sollte jeder benutzen können. ...
6 Replies - .NET Languages



All times are GMT +1. The time now is 23:15.


Powered by vBulletin®
Copyright ©2000 - 2017, Jelsoft Enterprises Ltd.
SEO by vBSEO ©2011, Crawlability, Inc.

Support | Contact Us | FAQ | Advertising | Privacy Policy | Abuse
Copyright ©2017 elitepvpers All Rights Reserved.