LibM2 - A LibGame SDK

10/23/2013 13:11 IgorGlock#121
Ding, iMer, wo hast du die examples hin?
:o sehe gerade Keine.
Lad' die direkt als Anhang in den Thread oder so.
10/23/2013 14:05 iMer#122
Hatte sie aus der Repo entfernt damit man keine Probleme mit doppelter Main und sowas hat, wenn man einfach alles compiled
[Only registered and activated users can see links. Click Here To Register...]
Da sind sie noch :)

Wiki bzw. neue Beispiele kommen bald

iMer
11/01/2013 18:38 ~Ok#123
Thanks Imer
11/01/2013 19:08 «Cassandra»#124
Danke fürs Teilen
11/30/2013 11:05 'ChuckNorris#125
Irgendwas hab ich wohl falsch eingerichtet...
Code:
mkdir -p build/Debug/GNU-Generic/src
rm -f "build/Debug/GNU-Generic/src/MyCommand.o.d"
g++    -c -g -fPIC  -MMD -MP -MF "build/Debug/GNU-Generic/src/MyCommand.o.d" -o build/Debug/GNU-Generic/src/MyCommand.o src/MyCommand.cpp
g++: error trying to exec 'cc1plus': execvp: No such file or directory
gmake[2]: *** [build/Debug/GNU-Generic/src/MyCommand.o] Error 1
Gruß,
Chuck
11/30/2013 11:32 Mr. 'Avenue™#126
Könntest du evtl. ein deutsches Tutorial machen ? :o
Oder PreCodings (Wo du codest & erklärst) :P
11/30/2013 11:33 Hermannx3#127
Bombe !
11/30/2013 12:14 'ChuckNorris#128
Quote:
Originally Posted by Mr. 'Avenue™ View Post
Könntest du evtl. ein deutsches Tutorial machen ? :o
Oder PreCodings (Wo du codest & erklärst) :P
Ich werde das bald machen wenn ich wieder alles eingerichtet habe wenn ihr das wollt.

Gruß,
Chuck
12/01/2013 01:56 FlAT!K#129
Quote:
||=== libm2, Release ===|
D:\codes\libm2\main.cpp|1|warning: -fPIC ignored for target (all code is position independent) [enabled by default]|
D:\codes\libm2\src\game\stdInclude.hpp|31|fatal error: netinet/in.h: No such file or directory|
||=== Build finished: 1 errors, 1 warnings (0 minutes, 5 seconds) ===|
How do I fix it?
12/01/2013 02:01 'ChuckNorris#130
You must build this on a FreeBSD system with remote build more in iMers video tutorial.

-----------

Schade das die LibM2::registerQuestTables(); Funktion bei mir dazu führt das der Core nicht mehr startet und somit das erstellen von neuen Quest Funktionen unmöglich wird oder mache ich da etwas falsch.

Gruß,
Chuck
12/01/2013 02:11 FlAT!K#131
I did it...
The letters can not really see it.

sorry for my bad english
12/01/2013 03:12 'ChuckNorris#132
Hab mal eine Erklärung zum Erstellen eines eigenen Commands gemacht eine Sache fehlt darin noch die ich selbst nicht zu erklären wusste.
[Only registered and activated users can see links. Click Here To Register...]

Mehr kommt später muss selbst erstmal verstehen was iMer da gemacht hat.

Gruß,
Chuck
12/24/2013 19:53 *Casi*#133
Quote:
Originally Posted by [LxR]ChuckNorris View Post
Hab mal eine Erklärung zum Erstellen eines eigenen Commands gemacht eine Sache fehlt darin noch die ich selbst nicht zu erklären wusste.
[Only registered and activated users can see links. Click Here To Register...]

Mehr kommt später muss selbst erstmal verstehen was iMer da gemacht hat.

Gruß,
Chuck
hey bekomme den fehler

/root/build/examples/MyCommand.hpp:146:1: error: stray '\257' in program
/root/build/examples/MyCommand.hpp:146:1: error: stray '\1' in program
/root/build/examples/MyCommand.hpp:146:1231: warning: null character(s) ignored [enabled by default]
/root/build/examples/MyCommand.hpp:146:1: error: stray '\362' in program
/root/build/examples/MyCommand.hpp:146:1: error: stray '\26' in program
/root/build/examples/MyCommand.hpp:146:1: error: stray '\1' in program
/root/build/examples/MyCommand.hpp:146:1: error: stray '\362' in program
/root/build/examples/MyCommand.hpp:146:1: error: stray '\26' in program
/root/build/examples/MyCommand.hpp:146:1: error: stray '\1' in program
12/24/2013 21:09 Computerfreek#134
Quote:
Originally Posted by *Casi* View Post
hey bekomme den fehler

/root/build/examples/MyCommand.hpp:146:1: error: stray '\257' in program
/root/build/examples/MyCommand.hpp:146:1: error: stray '\1' in program
/root/build/examples/MyCommand.hpp:146:1231: warning: null character(s) ignored [enabled by default]
/root/build/examples/MyCommand.hpp:146:1: error: stray '\362' in program
/root/build/examples/MyCommand.hpp:146:1: error: stray '\26' in program
/root/build/examples/MyCommand.hpp:146:1: error: stray '\1' in program
/root/build/examples/MyCommand.hpp:146:1: error: stray '\362' in program
/root/build/examples/MyCommand.hpp:146:1: error: stray '\26' in program
/root/build/examples/MyCommand.hpp:146:1: error: stray '\1' in program
Du benutzt CodeBlocks, oder?
STRG+[TASTE] schreibt unter Linux irgendwelche Steuerzeichen. So hast du vermutlich irgendwelche Steuerzeichen in denen Code geschrieben welche nicht anzeigbar sind und Fehler verursachen.
Drück STRG+A (alles markieren) und lösch alles. Danach schreib das Zeug neu oder kopiers neu ab - aber bitte nicht einfach löschen und dann den selben Rotz wieder reinkopieren.
Oder probiers mit Notepad++ und lass dir die nicht druckbaren Zeichen anzeigen, vilt. hast du da Glück.
12/24/2013 22:04 *Casi*#135
Quote:
Originally Posted by Computerfreek View Post
Du benutzt CodeBlocks, oder?
STRG+[TASTE] schreibt unter Linux irgendwelche Steuerzeichen. So hast du vermutlich irgendwelche Steuerzeichen in denen Code geschrieben welche nicht anzeigbar sind und Fehler verursachen.
Drück STRG+A (alles markieren) und lösch alles. Danach schreib das Zeug neu oder kopiers neu ab - aber bitte nicht einfach löschen und dann den selben Rotz wieder reinkopieren.
Oder probiers mit Notepad++ und lass dir die nicht druckbaren Zeichen anzeigen, vilt. hast du da Glück.
Ich nutze den hier

[Only registered and activated users can see links. Click Here To Register...]

ohne mycommand.cpp und hpp kann ich das sdk compilen damit