Register for your free account! | Forgot your password?

You last visited: Today at 14:43

  • Please register to post and access all features, it's quick, easy and FREE!


[C++/Source] Gildenlager

Discussion on [C++/Source] Gildenlager within the Metin2 PServer Guides & Strategies forum part of the Metin2 Private Server category.

Reply
 
Old 05/08/2015, 15:07   #181
 
elite*gold: 0
Join Date: Jan 2014
Posts: 267
Received Thanks: 368
Agorin, I mean are you sure that "ENABLE_GUILD_SAFEBOX" is defined at this position of the file? If you're not you can try to write in the same function anywhere:
Code:
#ifdef ENABLE_GUILD_SAFEBOX
TraceError("Test success");
#endif
and see if the error appears in the sys_err.txt.
If it doesn't appear you have to include the locale.h (#include "Locale.h") in the PythonSafeBox.cpp.

Kind Regards,
Lefloyd
Lefloyd is offline  
Old 05/08/2015, 18:01   #182
 
elite*gold: 0
Join Date: Feb 2014
Posts: 92
Received Thanks: 0
@Lefloyd, Still It Is ;/
Agorin is offline  
Old 05/08/2015, 18:03   #183
 
elite*gold: 0
Join Date: Jan 2014
Posts: 267
Received Thanks: 368
Agorin... you would really help me if you do as I said and report me the result (what have you done and what was the client message). I can't help you this way if you just say "Error!".

Kind Regards,
Lefloyd
Lefloyd is offline  
Old 05/08/2015, 18:58   #184
 
elite*gold: 0
Join Date: Feb 2014
Posts: 92
Received Thanks: 0
wait.
Agorin is offline  
Old 05/08/2015, 19:34   #185
 
elite*gold: 0
Join Date: Jan 2014
Posts: 267
Received Thanks: 368
Well.. this error doesn't occur because of anything that's in this thread; you have to clean up your Eterbase-Build (right click on the project and select "New compile" or however it's called).

Kind Regards,
Lefloyd
Lefloyd is offline  
Old 05/10/2015, 00:00   #186
 
elite*gold: 0
Join Date: Feb 2014
Posts: 92
Received Thanks: 0
x
Agorin is offline  
Old 05/10/2015, 12:02   #187

 
elite*gold: 35
Join Date: Jan 2014
Posts: 1,422
Received Thanks: 267
Jetzt müsste man nurnoch Rechte Verteilen können -> perfekt
Drαεth is offline  
Thanks
1 User
Old 05/10/2015, 18:23   #188
 
elite*gold: 0
Join Date: Dec 2011
Posts: 1,890
Received Thanks: 1,243
Hat das Gildenlager jetzt nun 3 Seiten? Und ist Yang einzahlbar?
Aber dennoch gut, wird eingebaut.

Gruß,
Souza.
.Soυzα is offline  
Old 05/11/2015, 13:50   #189
 
elite*gold: 0
Join Date: Jun 2012
Posts: 57
Received Thanks: 10
Quote:
Originally Posted by Lefloyd View Post
@yagokurt: You have to include service.h from common in the stdafx.h above all the other includes (if you don't know what I mean just post the stdafx.h).

Kind Regards,
Lefloyd
Lefloyd, i already have it included. Here i leave my stdafx.h for you


Here i leave again the error

Code:
[email protected]:/usr/src/game_testes/Srcs/Server/db/src # gmake -j20

p4: not found
p4: not found
compile Main.cpp
compile ClientManager.cpp
compile GuildSafeboxManager.cpp
In file included from stdafx.h:16,
                 from GuildSafeboxManager.cpp:1:
../../common/utils.h:112:7: warning: no newline at end of file
In file included from stdafx.h:16,
                 from ClientManager.cpp:2:
../../common/utils.h:112:7: warning: no newline at end of file
In file included from stdafx.h:16,
                 from Main.cpp:1:
../../common/utils.h:112:7: warning: no newline at end of file
In file included from ClientManager.cpp:6:
../../common/VnumHelper.h:59:32: warning: no newline at end of file
In file included from GuildSafeboxManager.cpp:4:
GuildSafeboxManager.h:67: error: 'GUILD_SAFEBOX_PASSWORD_MAX_LEN' was not declared in this scope
GuildSafeboxManager.h:70: error: 'GUILD_SAFEBOX_MAX_NUM' was not declared in this scope
GuildSafeboxManager.h:71: error: 'GUILD_SAFEBOX_MAX_NUM' was not declared in this scope
GuildSafeboxManager.h: In member function 'void CGuildSafebox::SetPassword(const char*)':
GuildSafeboxManager.h:36: error: 'm_szPassword' was not declared in this scope
GuildSafeboxManager.h: In member function 'const char* CGuildSafebox::GetPassword()':
GuildSafeboxManager.h:37: error: 'm_szPassword' was not declared in this scope
GuildSafeboxManager.h: In member function 'bool CGuildSafebox::CheckPassword(const char*) const':
GuildSafeboxManager.h:38: error: 'm_szPassword' was not declared in this scope
GuildSafeboxManager.h: In member function 'const TPlayerItem* CGuildSafebox::GetItem(BYTE) const':
GuildSafeboxManager.h:59: error: 'm_pItems' was not declared in this scope
GuildSafeboxManager.cpp: In constructor 'CGuildSafebox::CGuildSafebox(DWORD)':
GuildSafeboxManager.cpp:20: error: 'm_szPassword' was not declared in this scope
GuildSafeboxManager.cpp:23: error: 'm_pItems' was not declared in this scope
GuildSafeboxManager.cpp:24: error: 'm_bItemGrid' was not declared in this scope
GuildSafeboxManager.cpp: In destructor 'CGuildSafebox::~CGuildSafebox()':
GuildSafeboxManager.cpp:28: error: 'GUILD_SAFEBOX_MAX_NUM' was not declared in this scope
GuildSafeboxManager.cpp:30: error: 'm_pItems' was not declared in this scope
GuildSafeboxManager.cpp: In member function 'void CGuildSafebox::ChangeSize(BYTE, CPeer*)':
GuildSafeboxManager.cpp:42: error: 'HEADER_DG_GUILD_SAFEBOX_SIZE' was not declared in this scope
GuildSafeboxManager.cpp: In member function 'void CGuildSafebox::ChangeGold(int)':
GuildSafeboxManager.cpp:52: error: 'HEADER_DG_GUILD_SAFEBOX_GOLD' was not declared in this scope
GuildSafeboxManager.cpp: In member function 'void CGuildSafebox::LoadItems(SQLMsg*)':
GuildSafeboxManager.cpp:68: error: 'GUILD_SAFEBOX' was not declared in this scope
GuildSafeboxManager.cpp:79: error: 'struct TPlayerItem' has no member named 'is_gm_owner'
GuildSafeboxManager.cpp:97: error: 'GUILD_SAFEBOX_MAX_NUM' was not declared in this scope
GuildSafeboxManager.cpp:110: error: 'm_pItems' was not declared in this scope
GuildSafeboxManager.cpp:112: error: 'm_bItemGrid' was not declared in this scope
GuildSafeboxManager.cpp: In member function 'void CGuildSafebox::DeleteItems()':
GuildSafeboxManager.cpp:124: error: 'GUILD_SAFEBOX' was not declared in this scope
GuildSafeboxManager.cpp:127: error: 'GUILD_SAFEBOX_MAX_NUM' was not declared in this scope
GuildSafeboxManager.cpp:131: error: 'm_pItems' was not declared in this scope
GuildSafeboxManager.cpp:136: error: 'm_bItemGrid' was not declared in this scope
GuildSafeboxManager.cpp: In member function 'bool CGuildSafebox::IsValidCell(BYTE, BYTE) const':
GuildSafeboxManager.cpp:142: error: 'GUILD_SAFEBOX_MAX_NUM' was not declared in this scope
GuildSafeboxManager.cpp:142: error: 'GUILD_SAFEBOX_ITEM_WIDTH' was not declared in this scope
GuildSafeboxManager.cpp: In member function 'bool CGuildSafebox::IsFree(BYTE, BYTE) const':
GuildSafeboxManager.cpp:158: error: 'GUILD_SAFEBOX_ITEM_WIDTH' was not declared in this scope
GuildSafeboxManager.cpp:158: error: 'GUILD_SAFEBOX_ITEM_HEIGHT' was not declared in this scope
GuildSafeboxManager.cpp:175: error: 'm_bItemGrid' was not declared in this scope
GuildSafeboxManager.cpp: In member function 'void CGuildSafebox::RequestAddItem(CPeer*, DWORD, const TPlayerItem*)':
GuildSafeboxManager.cpp:205: error: 'm_pItems' was not declared in this scope
GuildSafeboxManager.cpp:207: error: 'GUILD_SAFEBOX' was not declared in this scope
GuildSafeboxManager.cpp:209: error: 'm_bItemGrid' was not declared in this scope
GuildSafeboxManager.cpp:209: error: 'GUILD_SAFEBOX_ITEM_WIDTH' was not declared in this scope
GuildSafeboxManager.cpp: In member function 'void CGuildSafebox::RequestMoveItem(BYTE, BYTE)':
GuildSafeboxManager.cpp:221: error: 'm_pItems' was not declared in this scope
GuildSafeboxManager.cpp:237: error: 'm_bItemGrid' was not declared in this scope
GuildSafeboxManager.cpp:237: error: 'GUILD_SAFEBOX_ITEM_WIDTH' was not declared in this scope
GuildSafeboxManager.cpp:242: error: 'm_bItemGrid' was not declared in this scope
GuildSafeboxManager.cpp:242: error: 'GUILD_SAFEBOX_ITEM_WIDTH' was not declared in this scope
GuildSafeboxManager.cpp: In member function 'void CGuildSafebox::RequestTakeItem(CPeer*, DWORD, BYTE, BYTE)':
GuildSafeboxManager.cpp:255: error: 'm_pItems' was not declared in this scope
GuildSafeboxManager.cpp:265: error: 'm_bItemGrid' was not declared in this scope
GuildSafeboxManager.cpp:265: error: 'GUILD_SAFEBOX_ITEM_WIDTH' was not declared in this scope
GuildSafeboxManager.cpp: In member function 'void CGuildSafebox::GiveItemToPlayer(CPeer*, DWORD, const TPlayerItem*)':
GuildSafeboxManager.cpp:282: error: 'HEADER_DG_GUILD_SAFEBOX_GIVE' was not declared in this scope
GuildSafeboxManager.cpp: In member function 'void CGuildSafebox::SendItemPacket(BYTE)':
GuildSafeboxManager.cpp:288: error: 'm_pItems' was not declared in this scope
GuildSafeboxManager.cpp:289: error: 'HEADER_DG_GUILD_SAFEBOX_SET' was not declared in this scope
GuildSafeboxManager.cpp:291: error: 'HEADER_DG_GUILD_SAFEBOX_DEL' was not declared in this scope
GuildSafeboxManager.cpp: In member function 'void CGuildSafebox::LoadItems(CPeer*, DWORD)':
GuildSafeboxManager.cpp:300: error: 'HEADER_DG_GUILD_SAFEBOX_LOAD' was not declared in this scope
GuildSafeboxManager.cpp:309: error: 'GUILD_SAFEBOX_MAX_NUM' was not declared in this scope
GuildSafeboxManager.cpp:317: error: 'HEADER_DG_GUILD_SAFEBOX_LOAD' was not declared in this scope
GuildSafeboxManager.cpp: In member function 'void CGuildSafeboxManager::Initialize()':
GuildSafeboxManager.cpp:368: warning: comparison between signed and unsigned integer expressions
GuildSafeboxManager.cpp:394: warning: zero-length printf format string
GuildSafeboxManager.cpp:394: warning: zero-length printf format string
GuildSafeboxManager.cpp:406: error: 'GUILD_SAFEBOX' was not declared in this scope
GuildSafeboxManager.cpp:394: warning: unused variable 'len'
GuildSafeboxManager.cpp: In member function 'void CGuildSafeboxManager::SaveSingleItem(TPlayerItem*)':
GuildSafeboxManager.cpp:480: error: 'GUILD_SAFEBOX' was not declared in this scope
GuildSafeboxManager.cpp:486: warning: zero-length printf format string
GuildSafeboxManager.cpp:486: warning: zero-length printf format string
GuildSafeboxManager.cpp:498: error: 'struct SPlayerItem' has no member named 'is_gm_owner'
GuildSafeboxManager.cpp:486: warning: unused variable 'len'
GuildSafeboxManager.cpp: In member function 'void CGuildSafeboxManager::ProcessPacket(CPeer*, DWORD, BYTE, const void*)':
GuildSafeboxManager.cpp:583: error: 'HEADER_GD_GUILD_SAFEBOX_ADD' was not declared in this scope
GuildSafeboxManager.cpp:597: error: 'HEADER_DG_GUILD_SAFEBOX_GIVE' was not declared in this scope
GuildSafeboxManager.cpp:603: error: 'HEADER_GD_GUILD_SAFEBOX_MOVE' was not declared in this scope
GuildSafeboxManager.cpp:605: error: expected initializer before '*' token
GuildSafeboxManager.cpp:606: error: 'p' was not declared in this scope
GuildSafeboxManager.cpp:614: error: 'HEADER_GD_GUILD_SAFEBOX_TAKE' was not declared in this scope
GuildSafeboxManager.cpp:616: error: expected initializer before '*' token
GuildSafeboxManager.cpp:617: error: 'p' was not declared in this scope
GuildSafeboxManager.cpp:625: error: 'HEADER_GD_GUILD_SAFEBOX_GIVE_GOLD' was not declared in this scope
GuildSafeboxManager.cpp:627: error: expected initializer before '*' token
GuildSafeboxManager.cpp:628: error: 'p' was not declared in this scope
GuildSafeboxManager.cpp:636: error: 'HEADER_GD_GUILD_SAFEBOX_GET_GOLD' was not declared in this scope
GuildSafeboxManager.cpp:638: error: expected initializer before '*' token
GuildSafeboxManager.cpp:639: error: 'p' was not declared in this scope
GuildSafeboxManager.cpp:642: error: 'HEADER_DG_GUILD_SAFEBOX_GOLD' was not declared in this scope
GuildSafeboxManager.cpp:661: error: 'HEADER_GD_GUILD_SAFEBOX_CREATE' was not declared in this scope
GuildSafeboxManager.cpp:688: error: 'HEADER_DG_GUILD_SAFEBOX_CREATE' was not declared in this scope
GuildSafeboxManager.cpp:695: error: 'HEADER_GD_GUILD_SAFEBOX_SIZE' was not declared in this scope
GuildSafeboxManager.cpp:710: error: 'HEADER_GD_GUILD_SAFEBOX_LOAD' was not declared in this scope
GuildSafeboxManager.cpp: In member function 'void CGuildSafeboxManager::InitSafeboxCore(CPeer*)':
GuildSafeboxManager.cpp:731: error: 'TGuildSafeboxInitial' was not declared in this scope
GuildSafeboxManager.cpp:731: error: expected ';' before 'init'
GuildSafeboxManager.cpp:732: error: 'init' was not declared in this scope
gmake: *** [.obj/GuildSafeboxManager.o] Error 1
gmake: *** Waiting for unfinished jobs....
In file included from Main.cpp:21:
GuildSafeboxManager.h:67: error: 'GUILD_SAFEBOX_PASSWORD_MAX_LEN' was not declared in this scope
GuildSafeboxManager.h:70: error: 'GUILD_SAFEBOX_MAX_NUM' was not declared in this scope
GuildSafeboxManager.h:71: error: 'GUILD_SAFEBOX_MAX_NUM' was not declared in this scope
GuildSafeboxManager.h: In member function 'void CGuildSafebox::SetPassword(const char*)':
GuildSafeboxManager.h:36: error: 'm_szPassword' was not declared in this scope
GuildSafeboxManager.h: In member function 'const char* CGuildSafebox::GetPassword()':
GuildSafeboxManager.h:37: error: 'm_szPassword' was not declared in this scope
GuildSafeboxManager.h: In member function 'bool CGuildSafebox::CheckPassword(const char*) const':
GuildSafeboxManager.h:38: error: 'm_szPassword' was not declared in this scope
GuildSafeboxManager.h: In member function 'const TPlayerItem* CGuildSafebox::GetItem(BYTE) const':
GuildSafeboxManager.h:59: error: 'm_pItems' was not declared in this scope
gmake: *** [.obj/Main.o] Error 1
In file included from ClientManager.cpp:26:
GuildSafeboxManager.h:67: error: 'GUILD_SAFEBOX_PASSWORD_MAX_LEN' was not declared in this scope
GuildSafeboxManager.h:70: error: 'GUILD_SAFEBOX_MAX_NUM' was not declared in this scope
GuildSafeboxManager.h:71: error: 'GUILD_SAFEBOX_MAX_NUM' was not declared in this scope
GuildSafeboxManager.h: In member function 'void CGuildSafebox::SetPassword(const char*)':
GuildSafeboxManager.h:36: error: 'm_szPassword' was not declared in this scope
GuildSafeboxManager.h: In member function 'const char* CGuildSafebox::GetPassword()':
GuildSafeboxManager.h:37: error: 'm_szPassword' was not declared in this scope
GuildSafeboxManager.h: In member function 'bool CGuildSafebox::CheckPassword(const char*) const':
GuildSafeboxManager.h:38: error: 'm_szPassword' was not declared in this scope
GuildSafeboxManager.h: In member function 'const TPlayerItem* CGuildSafebox::GetItem(BYTE) const':
GuildSafeboxManager.h:59: error: 'm_pItems' was not declared in this scope
ClientManager.cpp: In member function 'void CClientManager::QUERY_BOOT(CPeer*, TPacketGDBoot*)':
ClientManager.cpp:386: error: 'TGuildSafeboxInitial' was not declared in this scope
ClientManager.cpp: In member function 'void CClientManager::ProcessPackets(CPeer*)':
ClientManager.cpp:2820: error: 'HEADER_GD_GUILD_SAFEBOX_ADD' was not declared in this scope
ClientManager.cpp:2821: error: 'HEADER_GD_GUILD_SAFEBOX_MOVE' was not declared in this scope
ClientManager.cpp:2822: error: 'HEADER_GD_GUILD_SAFEBOX_TAKE' was not declared in this scope
ClientManager.cpp:2823: error: 'HEADER_GD_GUILD_SAFEBOX_GIVE_GOLD' was not declared in this scope
ClientManager.cpp:2824: error: 'HEADER_GD_GUILD_SAFEBOX_GET_GOLD' was not declared in this scope
ClientManager.cpp:2825: error: 'HEADER_GD_GUILD_SAFEBOX_CREATE' was not declared in this scope
ClientManager.cpp:2826: error: 'HEADER_GD_GUILD_SAFEBOX_SIZE' was not declared in this scope
ClientManager.cpp:2827: error: 'HEADER_GD_GUILD_SAFEBOX_LOAD' was not declared in this scope
gmake: *** [.obj/ClientManager.o] Error 1
yagokurt is offline  
Old 05/11/2015, 16:27   #190
 
elite*gold: 0
Join Date: Jan 2012
Posts: 120
Received Thanks: 17
0511 19:25:15118 :: Unknown packet header: 66, last: 63 45


Beim öffnen des Gildenlagers ^^
Forcetraeger is offline  
Old 05/13/2015, 00:32   #191
 
elite*gold: 0
Join Date: Jan 2015
Posts: 110
Received Thanks: 177
Quote:
Originally Posted by yagokurt View Post
Lefloyd, i already have it included. Here i leave my stdafx.h for you


Here i leave again the error

Code:
[email protected]:/usr/src/game_testes/Srcs/Server/db/src # gmake -j20

p4: not found
p4: not found
compile Main.cpp
compile ClientManager.cpp
compile GuildSafeboxManager.cpp
In file included from stdafx.h:16,
                 from GuildSafeboxManager.cpp:1:
../../common/utils.h:112:7: warning: no newline at end of file
In file included from stdafx.h:16,
                 from ClientManager.cpp:2:
../../common/utils.h:112:7: warning: no newline at end of file
In file included from stdafx.h:16,
                 from Main.cpp:1:
../../common/utils.h:112:7: warning: no newline at end of file
In file included from ClientManager.cpp:6:
../../common/VnumHelper.h:59:32: warning: no newline at end of file
In file included from GuildSafeboxManager.cpp:4:
GuildSafeboxManager.h:67: error: 'GUILD_SAFEBOX_PASSWORD_MAX_LEN' was not declared in this scope
GuildSafeboxManager.h:70: error: 'GUILD_SAFEBOX_MAX_NUM' was not declared in this scope
GuildSafeboxManager.h:71: error: 'GUILD_SAFEBOX_MAX_NUM' was not declared in this scope
GuildSafeboxManager.h: In member function 'void CGuildSafebox::SetPassword(const char*)':
GuildSafeboxManager.h:36: error: 'm_szPassword' was not declared in this scope
GuildSafeboxManager.h: In member function 'const char* CGuildSafebox::GetPassword()':
GuildSafeboxManager.h:37: error: 'm_szPassword' was not declared in this scope
GuildSafeboxManager.h: In member function 'bool CGuildSafebox::CheckPassword(const char*) const':
GuildSafeboxManager.h:38: error: 'm_szPassword' was not declared in this scope
GuildSafeboxManager.h: In member function 'const TPlayerItem* CGuildSafebox::GetItem(BYTE) const':
GuildSafeboxManager.h:59: error: 'm_pItems' was not declared in this scope
GuildSafeboxManager.cpp: In constructor 'CGuildSafebox::CGuildSafebox(DWORD)':
GuildSafeboxManager.cpp:20: error: 'm_szPassword' was not declared in this scope
GuildSafeboxManager.cpp:23: error: 'm_pItems' was not declared in this scope
GuildSafeboxManager.cpp:24: error: 'm_bItemGrid' was not declared in this scope
GuildSafeboxManager.cpp: In destructor 'CGuildSafebox::~CGuildSafebox()':
GuildSafeboxManager.cpp:28: error: 'GUILD_SAFEBOX_MAX_NUM' was not declared in this scope
GuildSafeboxManager.cpp:30: error: 'm_pItems' was not declared in this scope
GuildSafeboxManager.cpp: In member function 'void CGuildSafebox::ChangeSize(BYTE, CPeer*)':
GuildSafeboxManager.cpp:42: error: 'HEADER_DG_GUILD_SAFEBOX_SIZE' was not declared in this scope
GuildSafeboxManager.cpp: In member function 'void CGuildSafebox::ChangeGold(int)':
GuildSafeboxManager.cpp:52: error: 'HEADER_DG_GUILD_SAFEBOX_GOLD' was not declared in this scope
GuildSafeboxManager.cpp: In member function 'void CGuildSafebox::LoadItems(SQLMsg*)':
GuildSafeboxManager.cpp:68: error: 'GUILD_SAFEBOX' was not declared in this scope
GuildSafeboxManager.cpp:79: error: 'struct TPlayerItem' has no member named 'is_gm_owner'
GuildSafeboxManager.cpp:97: error: 'GUILD_SAFEBOX_MAX_NUM' was not declared in this scope
GuildSafeboxManager.cpp:110: error: 'm_pItems' was not declared in this scope
GuildSafeboxManager.cpp:112: error: 'm_bItemGrid' was not declared in this scope
GuildSafeboxManager.cpp: In member function 'void CGuildSafebox::DeleteItems()':
GuildSafeboxManager.cpp:124: error: 'GUILD_SAFEBOX' was not declared in this scope
GuildSafeboxManager.cpp:127: error: 'GUILD_SAFEBOX_MAX_NUM' was not declared in this scope
GuildSafeboxManager.cpp:131: error: 'm_pItems' was not declared in this scope
GuildSafeboxManager.cpp:136: error: 'm_bItemGrid' was not declared in this scope
GuildSafeboxManager.cpp: In member function 'bool CGuildSafebox::IsValidCell(BYTE, BYTE) const':
GuildSafeboxManager.cpp:142: error: 'GUILD_SAFEBOX_MAX_NUM' was not declared in this scope
GuildSafeboxManager.cpp:142: error: 'GUILD_SAFEBOX_ITEM_WIDTH' was not declared in this scope
GuildSafeboxManager.cpp: In member function 'bool CGuildSafebox::IsFree(BYTE, BYTE) const':
GuildSafeboxManager.cpp:158: error: 'GUILD_SAFEBOX_ITEM_WIDTH' was not declared in this scope
GuildSafeboxManager.cpp:158: error: 'GUILD_SAFEBOX_ITEM_HEIGHT' was not declared in this scope
GuildSafeboxManager.cpp:175: error: 'm_bItemGrid' was not declared in this scope
GuildSafeboxManager.cpp: In member function 'void CGuildSafebox::RequestAddItem(CPeer*, DWORD, const TPlayerItem*)':
GuildSafeboxManager.cpp:205: error: 'm_pItems' was not declared in this scope
GuildSafeboxManager.cpp:207: error: 'GUILD_SAFEBOX' was not declared in this scope
GuildSafeboxManager.cpp:209: error: 'm_bItemGrid' was not declared in this scope
GuildSafeboxManager.cpp:209: error: 'GUILD_SAFEBOX_ITEM_WIDTH' was not declared in this scope
GuildSafeboxManager.cpp: In member function 'void CGuildSafebox::RequestMoveItem(BYTE, BYTE)':
GuildSafeboxManager.cpp:221: error: 'm_pItems' was not declared in this scope
GuildSafeboxManager.cpp:237: error: 'm_bItemGrid' was not declared in this scope
GuildSafeboxManager.cpp:237: error: 'GUILD_SAFEBOX_ITEM_WIDTH' was not declared in this scope
GuildSafeboxManager.cpp:242: error: 'm_bItemGrid' was not declared in this scope
GuildSafeboxManager.cpp:242: error: 'GUILD_SAFEBOX_ITEM_WIDTH' was not declared in this scope
GuildSafeboxManager.cpp: In member function 'void CGuildSafebox::RequestTakeItem(CPeer*, DWORD, BYTE, BYTE)':
GuildSafeboxManager.cpp:255: error: 'm_pItems' was not declared in this scope
GuildSafeboxManager.cpp:265: error: 'm_bItemGrid' was not declared in this scope
GuildSafeboxManager.cpp:265: error: 'GUILD_SAFEBOX_ITEM_WIDTH' was not declared in this scope
GuildSafeboxManager.cpp: In member function 'void CGuildSafebox::GiveItemToPlayer(CPeer*, DWORD, const TPlayerItem*)':
GuildSafeboxManager.cpp:282: error: 'HEADER_DG_GUILD_SAFEBOX_GIVE' was not declared in this scope
GuildSafeboxManager.cpp: In member function 'void CGuildSafebox::SendItemPacket(BYTE)':
GuildSafeboxManager.cpp:288: error: 'm_pItems' was not declared in this scope
GuildSafeboxManager.cpp:289: error: 'HEADER_DG_GUILD_SAFEBOX_SET' was not declared in this scope
GuildSafeboxManager.cpp:291: error: 'HEADER_DG_GUILD_SAFEBOX_DEL' was not declared in this scope
GuildSafeboxManager.cpp: In member function 'void CGuildSafebox::LoadItems(CPeer*, DWORD)':
GuildSafeboxManager.cpp:300: error: 'HEADER_DG_GUILD_SAFEBOX_LOAD' was not declared in this scope
GuildSafeboxManager.cpp:309: error: 'GUILD_SAFEBOX_MAX_NUM' was not declared in this scope
GuildSafeboxManager.cpp:317: error: 'HEADER_DG_GUILD_SAFEBOX_LOAD' was not declared in this scope
GuildSafeboxManager.cpp: In member function 'void CGuildSafeboxManager::Initialize()':
GuildSafeboxManager.cpp:368: warning: comparison between signed and unsigned integer expressions
GuildSafeboxManager.cpp:394: warning: zero-length printf format string
GuildSafeboxManager.cpp:394: warning: zero-length printf format string
GuildSafeboxManager.cpp:406: error: 'GUILD_SAFEBOX' was not declared in this scope
GuildSafeboxManager.cpp:394: warning: unused variable 'len'
GuildSafeboxManager.cpp: In member function 'void CGuildSafeboxManager::SaveSingleItem(TPlayerItem*)':
GuildSafeboxManager.cpp:480: error: 'GUILD_SAFEBOX' was not declared in this scope
GuildSafeboxManager.cpp:486: warning: zero-length printf format string
GuildSafeboxManager.cpp:486: warning: zero-length printf format string
GuildSafeboxManager.cpp:498: error: 'struct SPlayerItem' has no member named 'is_gm_owner'
GuildSafeboxManager.cpp:486: warning: unused variable 'len'
GuildSafeboxManager.cpp: In member function 'void CGuildSafeboxManager::ProcessPacket(CPeer*, DWORD, BYTE, const void*)':
GuildSafeboxManager.cpp:583: error: 'HEADER_GD_GUILD_SAFEBOX_ADD' was not declared in this scope
GuildSafeboxManager.cpp:597: error: 'HEADER_DG_GUILD_SAFEBOX_GIVE' was not declared in this scope
GuildSafeboxManager.cpp:603: error: 'HEADER_GD_GUILD_SAFEBOX_MOVE' was not declared in this scope
GuildSafeboxManager.cpp:605: error: expected initializer before '*' token
GuildSafeboxManager.cpp:606: error: 'p' was not declared in this scope
GuildSafeboxManager.cpp:614: error: 'HEADER_GD_GUILD_SAFEBOX_TAKE' was not declared in this scope
GuildSafeboxManager.cpp:616: error: expected initializer before '*' token
GuildSafeboxManager.cpp:617: error: 'p' was not declared in this scope
GuildSafeboxManager.cpp:625: error: 'HEADER_GD_GUILD_SAFEBOX_GIVE_GOLD' was not declared in this scope
GuildSafeboxManager.cpp:627: error: expected initializer before '*' token
GuildSafeboxManager.cpp:628: error: 'p' was not declared in this scope
GuildSafeboxManager.cpp:636: error: 'HEADER_GD_GUILD_SAFEBOX_GET_GOLD' was not declared in this scope
GuildSafeboxManager.cpp:638: error: expected initializer before '*' token
GuildSafeboxManager.cpp:639: error: 'p' was not declared in this scope
GuildSafeboxManager.cpp:642: error: 'HEADER_DG_GUILD_SAFEBOX_GOLD' was not declared in this scope
GuildSafeboxManager.cpp:661: error: 'HEADER_GD_GUILD_SAFEBOX_CREATE' was not declared in this scope
GuildSafeboxManager.cpp:688: error: 'HEADER_DG_GUILD_SAFEBOX_CREATE' was not declared in this scope
GuildSafeboxManager.cpp:695: error: 'HEADER_GD_GUILD_SAFEBOX_SIZE' was not declared in this scope
GuildSafeboxManager.cpp:710: error: 'HEADER_GD_GUILD_SAFEBOX_LOAD' was not declared in this scope
GuildSafeboxManager.cpp: In member function 'void CGuildSafeboxManager::InitSafeboxCore(CPeer*)':
GuildSafeboxManager.cpp:731: error: 'TGuildSafeboxInitial' was not declared in this scope
GuildSafeboxManager.cpp:731: error: expected ';' before 'init'
GuildSafeboxManager.cpp:732: error: 'init' was not declared in this scope
gmake: *** [.obj/GuildSafeboxManager.o] Error 1
gmake: *** Waiting for unfinished jobs....
In file included from Main.cpp:21:
GuildSafeboxManager.h:67: error: 'GUILD_SAFEBOX_PASSWORD_MAX_LEN' was not declared in this scope
GuildSafeboxManager.h:70: error: 'GUILD_SAFEBOX_MAX_NUM' was not declared in this scope
GuildSafeboxManager.h:71: error: 'GUILD_SAFEBOX_MAX_NUM' was not declared in this scope
GuildSafeboxManager.h: In member function 'void CGuildSafebox::SetPassword(const char*)':
GuildSafeboxManager.h:36: error: 'm_szPassword' was not declared in this scope
GuildSafeboxManager.h: In member function 'const char* CGuildSafebox::GetPassword()':
GuildSafeboxManager.h:37: error: 'm_szPassword' was not declared in this scope
GuildSafeboxManager.h: In member function 'bool CGuildSafebox::CheckPassword(const char*) const':
GuildSafeboxManager.h:38: error: 'm_szPassword' was not declared in this scope
GuildSafeboxManager.h: In member function 'const TPlayerItem* CGuildSafebox::GetItem(BYTE) const':
GuildSafeboxManager.h:59: error: 'm_pItems' was not declared in this scope
gmake: *** [.obj/Main.o] Error 1
In file included from ClientManager.cpp:26:
GuildSafeboxManager.h:67: error: 'GUILD_SAFEBOX_PASSWORD_MAX_LEN' was not declared in this scope
GuildSafeboxManager.h:70: error: 'GUILD_SAFEBOX_MAX_NUM' was not declared in this scope
GuildSafeboxManager.h:71: error: 'GUILD_SAFEBOX_MAX_NUM' was not declared in this scope
GuildSafeboxManager.h: In member function 'void CGuildSafebox::SetPassword(const char*)':
GuildSafeboxManager.h:36: error: 'm_szPassword' was not declared in this scope
GuildSafeboxManager.h: In member function 'const char* CGuildSafebox::GetPassword()':
GuildSafeboxManager.h:37: error: 'm_szPassword' was not declared in this scope
GuildSafeboxManager.h: In member function 'bool CGuildSafebox::CheckPassword(const char*) const':
GuildSafeboxManager.h:38: error: 'm_szPassword' was not declared in this scope
GuildSafeboxManager.h: In member function 'const TPlayerItem* CGuildSafebox::GetItem(BYTE) const':
GuildSafeboxManager.h:59: error: 'm_pItems' was not declared in this scope
ClientManager.cpp: In member function 'void CClientManager::QUERY_BOOT(CPeer*, TPacketGDBoot*)':
ClientManager.cpp:386: error: 'TGuildSafeboxInitial' was not declared in this scope
ClientManager.cpp: In member function 'void CClientManager::ProcessPackets(CPeer*)':
ClientManager.cpp:2820: error: 'HEADER_GD_GUILD_SAFEBOX_ADD' was not declared in this scope
ClientManager.cpp:2821: error: 'HEADER_GD_GUILD_SAFEBOX_MOVE' was not declared in this scope
ClientManager.cpp:2822: error: 'HEADER_GD_GUILD_SAFEBOX_TAKE' was not declared in this scope
ClientManager.cpp:2823: error: 'HEADER_GD_GUILD_SAFEBOX_GIVE_GOLD' was not declared in this scope
ClientManager.cpp:2824: error: 'HEADER_GD_GUILD_SAFEBOX_GET_GOLD' was not declared in this scope
ClientManager.cpp:2825: error: 'HEADER_GD_GUILD_SAFEBOX_CREATE' was not declared in this scope
ClientManager.cpp:2826: error: 'HEADER_GD_GUILD_SAFEBOX_SIZE' was not declared in this scope
ClientManager.cpp:2827: error: 'HEADER_GD_GUILD_SAFEBOX_LOAD' was not declared in this scope
gmake: *** [.obj/ClientManager.o] Error 1
#include "../../common/length.h"
#include "../../common/tables.h"
#include "../../common/singleton.h"
#include "../../common/utils.h"
#include "../../common/stl.h"
#include "../../common/service.h"

to

#include "../../common/service.h"
#include "../../common/length.h"
#include "../../common/tables.h"
#include "../../common/singleton.h"
#include "../../common/utils.h"
#include "../../common/stl.h"
*~*TeacheR*~* is offline  
Old 05/13/2015, 07:07   #192
 
elite*gold: 0
Join Date: Jun 2012
Posts: 57
Received Thanks: 10
Quote:
Originally Posted by *~*TeacheR*~* View Post
#include "../../common/length.h"
#include "../../common/tables.h"
#include "../../common/singleton.h"
#include "../../common/utils.h"
#include "../../common/stl.h"
#include "../../common/service.h"

to

#include "../../common/service.h"
#include "../../common/length.h"
#include "../../common/tables.h"
#include "../../common/singleton.h"
#include "../../common/utils.h"
#include "../../common/stl.h"

Thank you, it solve the old error but now i got this output after try to compile.

Code:
Script started on Tue May 12 23:03:43 2015
You have mail.
[email protected]:/usr/src/game_testes/Srcs/Server/db/src # gmake -j20

p4: not found
p4: not found
gmake: Warning: File 'stdafx.h' has modification time 10784 s in the future
compile Config.cpp
compile NetBase.cpp
compile Peer.cpp
compile PeerBase.cpp
compile Main.cpp
In file included from stdafx.h:17,
                 from Config.cpp:1:
../../common/utils.h:112:7: warning: no newline at end of file
In file included from stdafx.h:17,
                 from Peer.cpp:1:
../../common/utils.h:112:7: warning: no newline at end of file
In file included from stdafx.h:17,
                 from NetBase.cpp:1:
../../common/utils.h:112:7: warning: no newline at end of file
In file included from stdafx.h:17,
                 from PeerBase.cpp:1:
../../common/utils.h:112:7: warning: no newline at end of file
compile Lock.cpp
In file included from stdafx.h:17,
                 from Main.cpp:1:
../../common/utils.h:112:7: warning: no newline at end of file
compile DBManager.cpp
compile Cache.cpp
compile LoginData.cpp
compile ClientManager.cpp
compile ClientManagerPlayer.cpp
compile ClientManagerLogin.cpp
compile ClientManagerBoot.cpp
compile ClientManagerParty.cpp
compile ClientManagerGuild.cpp
compile GuildManager.cpp
compile HB.cpp
In file included from stdafx.h:17,
                 from DBManager.cpp:1:
../../common/utils.h:112:7: warning: no newline at end of file
In file included from stdafx.h:17,
                 from Lock.cpp:1:
../../common/utils.h:112:7: warning: no newline at end of file
In file included from stdafx.h:17,
                 from Cache.cpp:2:
../../common/utils.h:112:7: warning: no newline at end of file
In file included from stdafx.h:17,
                 from LoginData.cpp:1:
../../common/utils.h:112:7: warning: no newline at end of file
In file included from stdafx.h:17,
                 from ClientManager.cpp:2:
../../common/utils.h:112:7: warning: no newline at end of file
In file included from ClientManager.cpp:6:
../../common/VnumHelper.h:59:32: warning: no newline at end of file
In file included from stdafx.h:17,
                 from ClientManagerLogin.cpp:2:
../../common/utils.h:112:7: warning: no newline at end of file
In file included from stdafx.h:17,
                 from ClientManagerParty.cpp:2:
../../common/utils.h:112:7: warning: no newline at end of file
In file included from stdafx.h:17,
                 from ClientManagerGuild.cpp:2:
../../common/utils.h:112:7: warning: no newline at end of file
In file included from stdafx.h:17,
                 from ClientManagerPlayer.cpp:2:
../../common/utils.h:112:7: warning: no newline at end of file
In file included from stdafx.h:17,
                 from ClientManagerBoot.cpp:3:
../../common/utils.h:112:7: warning: no newline at end of file
Cache.cpp:365:7: warning: no newline at end of file
In file included from stdafx.h:17,
                 from HB.cpp:1:
../../common/utils.h:112:7: warning: no newline at end of file
compile PrivManager.cpp
In file included from stdafx.h:17,
                 from GuildManager.cpp:1:
../../common/utils.h:112:7: warning: no newline at end of file
In file included from ClientManagerBoot.cpp:8:
ProtoReader.h:36:7: warning: no newline at end of file
compile MoneyLog.cpp
In file included from stdafx.h:17,
                 from PrivManager.cpp:1:
../../common/utils.h:112:7: warning: no newline at end of file
compile ItemAwardManager.cpp
In file included from stdafx.h:17,
                 from MoneyLog.cpp:1:
../../common/utils.h:112:7: warning: no newline at end of file
ClientManagerPlayer.cpp: In member function 'char* CClientManager::GetCommand(char*)':
ClientManagerPlayer.cpp:433: warning: address of local variable 'command' returned
compile ClientManagerEventFlag.cpp
In file included from stdafx.h:17,
                 from ItemAwardManager.cpp:1:
../../common/utils.h:112:7: warning: no newline at end of file
ClientManagerBoot.cpp: In member function 'bool CClientManager::InitializeMobTable()':
ClientManagerBoot.cpp:402: warning: statement has no effect
ClientManagerBoot.cpp: In member function 'bool CClientManager::InitializeItemTable()':
ClientManagerBoot.cpp:703: warning: unused variable 'testValue'
ClientManagerBoot.cpp: In member function 'bool CClientManager::MirrorItemTableIntoDB()':
ClientManagerBoot.cpp:1491: warning: format '%d' expects type 'int', but argument 25 has type 'long int'
ClientManagerBoot.cpp:1491: warning: format '%d' expects type 'int', but argument 27 has type 'long int'
ClientManagerBoot.cpp:1491: warning: format '%d' expects type 'int', but argument 29 has type 'long int'
ClientManagerBoot.cpp:1491: warning: format '%d' expects type 'int', but argument 31 has type 'long int'
ClientManagerBoot.cpp:1491: warning: format '%d' expects type 'int', but argument 33 has type 'long int'
ClientManagerBoot.cpp:1491: warning: format '%d' expects type 'int', but argument 34 has type 'long int'
ClientManagerBoot.cpp:1491: warning: format '%d' expects type 'int', but argument 35 has type 'long int'
ClientManagerBoot.cpp:1491: warning: format '%d' expects type 'int', but argument 36 has type 'long int'
ClientManagerBoot.cpp:1491: warning: format '%d' expects type 'int', but argument 37 has type 'long int'
ClientManagerBoot.cpp:1491: warning: format '%d' expects type 'int', but argument 38 has type 'long int'
ClientManagerBoot.cpp:1491: warning: format '%d' expects type 'int', but argument 39 has type 'long int'
ClientManagerBoot.cpp:1491: warning: format '%d' expects type 'int', but argument 25 has type 'long int'
ClientManagerBoot.cpp:1491: warning: format '%d' expects type 'int', but argument 27 has type 'long int'
ClientManagerBoot.cpp:1491: warning: format '%d' expects type 'int', but argument 29 has type 'long int'
ClientManagerBoot.cpp:1491: warning: format '%d' expects type 'int', but argument 31 has type 'long int'
ClientManagerBoot.cpp:1491: warning: format '%d' expects type 'int', but argument 33 has type 'long int'
ClientManagerBoot.cpp:1491: warning: format '%d' expects type 'int', but argument 34 has type 'long int'
ClientManagerBoot.cpp:1491: warning: format '%d' expects type 'int', but argument 35 has type 'long int'
ClientManagerBoot.cpp:1491: warning: format '%d' expects type 'int', but argument 36 has type 'long int'
ClientManagerBoot.cpp:1491: warning: format '%d' expects type 'int', but argument 37 has type 'long int'
ClientManagerBoot.cpp:1491: warning: format '%d' expects type 'int', but argument 38 has type 'long int'
ClientManagerBoot.cpp:1491: warning: format '%d' expects type 'int', but argument 39 has type 'long int'
ClientManagerBoot.cpp:1519: warning: format '%d' expects type 'int', but argument 23 has type 'long int'
ClientManagerBoot.cpp:1519: warning: format '%d' expects type 'int', but argument 25 has type 'long int'
ClientManagerBoot.cpp:1519: warning: format '%d' expects type 'int', but argument 27 has type 'long int'
ClientManagerBoot.cpp:1519: warning: format '%d' expects type 'int', but argument 29 has type 'long int'
ClientManagerBoot.cpp:1519: warning: format '%d' expects type 'int', but argument 31 has type 'long int'
ClientManagerBoot.cpp:1519: warning: format '%d' expects type 'int', but argument 32 has type 'long int'
ClientManagerBoot.cpp:1519: warning: format '%d' expects type 'int', but argument 33 has type 'long int'
ClientManagerBoot.cpp:1519: warning: format '%d' expects type 'int', but argument 34 has type 'long int'
ClientManagerBoot.cpp:1519: warning: format '%d' expects type 'int', but argument 35 has type 'long int'
ClientManagerBoot.cpp:1519: warning: format '%d' expects type 'int', but argument 36 has type 'long int'
ClientManagerBoot.cpp:1519: warning: format '%d' expects type 'int', but argument 37 has type 'long int'
ClientManagerBoot.cpp:1519: warning: format '%d' expects type 'int', but argument 23 has type 'long int'
ClientManagerBoot.cpp:1519: warning: format '%d' expects type 'int', but argument 25 has type 'long int'
ClientManagerBoot.cpp:1519: warning: format '%d' expects type 'int', but argument 27 has type 'long int'
ClientManagerBoot.cpp:1519: warning: format '%d' expects type 'int', but argument 29 has type 'long int'
ClientManagerBoot.cpp:1519: warning: format '%d' expects type 'int', but argument 31 has type 'long int'
ClientManagerBoot.cpp:1519: warning: format '%d' expects type 'int', but argument 32 has type 'long int'
ClientManagerBoot.cpp:1519: warning: format '%d' expects type 'int', but argument 33 has type 'long int'
ClientManagerBoot.cpp:1519: warning: format '%d' expects type 'int', but argument 34 has type 'long int'
ClientManagerBoot.cpp:1519: warning: format '%d' expects type 'int', but argument 35 has type 'long int'
ClientManagerBoot.cpp:1519: warning: format '%d' expects type 'int', but argument 36 has type 'long int'
ClientManagerBoot.cpp:1519: warning: format '%d' expects type 'int', but argument 37 has type 'long int'
ItemAwardManager.cpp:129:2: warning: no newline at end of file
compile Marriage.cpp
In file included from stdafx.h:17,
                 from ClientManagerEventFlag.cpp:2:
../../common/utils.h:112:7: warning: no newline at end of file
compile BlockCountry.cpp
In file included from stdafx.h:17,
                 from Marriage.cpp:1:
../../common/utils.h:112:7: warning: no newline at end of file
compile ItemIDRangeManager.cpp
In file included from stdafx.h:17,
                 from BlockCountry.cpp:9:
../../common/utils.h:112:7: warning: no newline at end of file
compile ClientManagerHorseName.cpp
In file included from stdafx.h:17,
                 from ItemIDRangeManager.cpp:1:
../../common/utils.h:112:7: warning: no newline at end of file
compile AuctionManager.cpp
In file included from stdafx.h:17,
                 from ClientManagerHorseName.cpp:2:
../../common/utils.h:112:7: warning: no newline at end of file
compile ProtoReader.cpp
In file included from stdafx.h:17,
                 from AuctionManager.cpp:1:
../../common/utils.h:112:7: warning: no newline at end of file
AuctionManager.cpp:719:7: warning: no newline at end of file
compile GuildSafeboxManager.cpp
In file included from stdafx.h:17,
                 from ProtoReader.cpp:1:
../../common/utils.h:112:7: warning: no newline at end of file
In file included from ProtoReader.cpp:4:
ProtoReader.h:36:7: warning: no newline at end of file
compile CsvReader.cpp
In file included from stdafx.h:17,
                 from GuildSafeboxManager.cpp:1:
../../common/utils.h:112:7: warning: no newline at end of file
ProtoReader.cpp: In function 'std::string* StringSplit(std::string, std::string)':
ProtoReader.cpp:33: warning: comparison between signed and unsigned integer expressions
ProtoReader.cpp: In function 'int get_Item_Type_Value(std::string)':
ProtoReader.cpp:88: warning: comparison between signed and unsigned integer expressions
ProtoReader.cpp: In function 'int get_Item_SubType_Value(int, std::string)':
ProtoReader.cpp:207: warning: comparison between signed and unsigned integer expressions
ProtoReader.cpp:210: warning: comparison between signed and unsigned integer expressions
ProtoReader.cpp: In function 'int get_Item_AntiFlag_Value(std::string)':
ProtoReader.cpp:253: warning: comparison between signed and unsigned integer expressions
ProtoReader.cpp: In function 'int get_Item_Flag_Value(std::string)':
ProtoReader.cpp:282: warning: comparison between signed and unsigned integer expressions
ProtoReader.cpp: In function 'int get_Item_WearFlag_Value(std::string)':
ProtoReader.cpp:310: warning: comparison between signed and unsigned integer expressions
ProtoReader.cpp: In function 'int get_Item_Immune_Value(std::string)':
ProtoReader.cpp:336: warning: comparison between signed and unsigned integer expressions
ProtoReader.cpp: In function 'int get_Item_LimitType_Value(std::string)':
ProtoReader.cpp:364: warning: comparison between signed and unsigned integer expressions
ProtoReader.cpp: In function 'int get_Item_ApplyType_Value(std::string)':
ProtoReader.cpp:403: warning: comparison between signed and unsigned integer expressions
ProtoReader.cpp: In function 'int get_Mob_Rank_Value(std::string)':
ProtoReader.cpp:429: warning: comparison between signed and unsigned integer expressions
ProtoReader.cpp: In function 'int get_Mob_Type_Value(std::string)':
ProtoReader.cpp:451: warning: comparison between signed and unsigned integer expressions
ProtoReader.cpp: In function 'int get_Mob_BattleType_Value(std::string)':
ProtoReader.cpp:472: warning: comparison between signed and unsigned integer expressions
ProtoReader.cpp: In function 'int get_Mob_Size_Value(std::string)':
ProtoReader.cpp:493: warning: comparison between signed and unsigned integer expressions
ProtoReader.cpp: In function 'int get_Mob_AIFlag_Value(std::string)':
ProtoReader.cpp:515: warning: comparison between signed and unsigned integer expressions
ProtoReader.cpp: In function 'int get_Mob_RaceFlag_Value(std::string)':
ProtoReader.cpp:540: warning: comparison between signed and unsigned integer expressions
ProtoReader.cpp: In function 'int get_Mob_ImmuneFlag_Value(std::string)':
ProtoReader.cpp:564: warning: comparison between signed and unsigned integer expressions
ProtoReader.cpp: In function 'bool Set_Proto_Item_Table(TItemTable*, cCsvTable&, std::map<int, const char*, std::less<int>, std::allocator<std::pair<const int, const char*> > >&)':
ProtoReader.cpp:699: warning: comparison between signed and unsigned integer expressions
ProtoReader.cpp:760: warning: comparison between signed and unsigned integer expressions
In file included from stdafx.h:17,
                 from CsvReader.cpp:1:
../../common/utils.h:112:7: warning: no newline at end of file
CsvReader.cpp: In member function 'const char* cCsvAlias::operator[](size_t) const':
CsvReader.cpp:72: warning: left-hand operand of comma has no effect
CsvReader.cpp:72: warning: right-hand operand of comma has no effect
CsvReader.cpp: In member function 'size_t cCsvAlias::operator[](const char*) const':
CsvReader.cpp:90: warning: left-hand operand of comma has no effect
CsvReader.cpp:90: warning: right-hand operand of comma has no effect
GuildSafeboxManager.cpp: In member function 'void CGuildSafebox::LoadItems(SQLMsg*)':
GuildSafeboxManager.cpp:79: error: 'struct TPlayerItem' has no member named 'is_gm_owner'
GuildSafeboxManager.cpp: In member function 'void CGuildSafeboxManager::Initialize()':
GuildSafeboxManager.cpp:368: warning: comparison between signed and unsigned integer expressions
GuildSafeboxManager.cpp:394: warning: zero-length printf format string
GuildSafeboxManager.cpp:394: warning: zero-length printf format string
GuildSafeboxManager.cpp:394: warning: unused variable 'len'
GuildSafeboxManager.cpp: In member function 'void CGuildSafeboxManager::SaveSingleItem(TPlayerItem*)':
GuildSafeboxManager.cpp:486: warning: zero-length printf format string
GuildSafeboxManager.cpp:486: warning: zero-length printf format string
GuildSafeboxManager.cpp:498: error: 'struct SPlayerItem' has no member named 'is_gm_owner'
GuildSafeboxManager.cpp:486: warning: unused variable 'len'
gmake: *** [.obj/GuildSafeboxManager.o] Error 1
gmake: *** Waiting for unfinished jobs....
[email protected]:/usr/src/game_testes/Srcs/Server/db/src # exit
yagokurt is offline  
Old 05/13/2015, 07:21   #193
 
elite*gold: 0
Join Date: Jan 2012
Posts: 120
Received Thanks: 17
Delete is gm owner
Forcetraeger is offline  
Old 05/26/2015, 18:38   #194
 
elite*gold: 0
Join Date: Jun 2012
Posts: 57
Received Thanks: 10
Error to compile DB.

Code:
[email protected]:/usr/src/guild_almacen/Srcs/Server/db/src # gmake -j20

p4: not found
p4: not found
compile Main.cpp
compile ClientManager.cpp
In file included from stdafx.h:16,
                 from ClientManager.cpp:2:
../../common/utils.h:112:7: warning: no newline at end of file
In file included from ClientManager.cpp:6:
../../common/VnumHelper.h:59:32: warning: no newline at end of file
compile ItemAwardManager.cpp
In file included from stdafx.h:16,
                 from Main.cpp:1:
../../common/utils.h:112:7: warning: no newline at end of file
compile ClientManagerEventFlag.cpp
In file included from stdafx.h:16,
                 from ItemAwardManager.cpp:1:
../../common/utils.h:112:7: warning: no newline at end of file
compile Marriage.cpp
In file included from stdafx.h:16,
                 from ClientManagerEventFlag.cpp:2:
../../common/utils.h:112:7: warning: no newline at end of file
compile Monarch.cpp
In file included from stdafx.h:16,
                 from Marriage.cpp:1:
../../common/utils.h:112:7: warning: no newline at end of file
compile BlockCountry.cpp
ItemAwardManager.cpp:129:2: warning: no newline at end of file
In file included from Monarch.cpp:2:
../../common/utils.h:112:7: warning: no newline at end of file
compile ItemIDRangeManager.cpp
In file included from stdafx.h:16,
                 from BlockCountry.cpp:9:
../../common/utils.h:112:7: warning: no newline at end of file
compile ClientManagerHorseName.cpp
In file included from stdafx.h:16,
                 from ItemIDRangeManager.cpp:1:
../../common/utils.h:112:7: warning: no newline at end of file
p4: not found
In file included from stdafx.h:16,
                 from ClientManagerHorseName.cpp:2:
../../common/utils.h:112:7: warning: no newline at end of file
compile AuctionManager.cpp
compile ProtoReader.cpp
compile CsvReader.cpp
In file included from stdafx.h:16,
                 from ProtoReader.cpp:1:
../../common/utils.h:112:7: warning: no newline at end of file
In file included from ProtoReader.cpp:4:
ProtoReader.h:36:7: warning: no newline at end of file
compile version.cpp
In file included from stdafx.h:16,
                 from AuctionManager.cpp:1:
../../common/utils.h:112:7: warning: no newline at end of file
AuctionManager.cpp:719:7: warning: no newline at end of file
In file included from ClientManager.cpp:26:
GuildSafeboxManager.h:67: error: 'GUILD_SAFEBOX_PASSWORD_MAX_LEN' was not declared in this scope
GuildSafeboxManager.h:70: error: 'GUILD_SAFEBOX_MAX_NUM' was not declared in this scope
GuildSafeboxManager.h:71: error: 'GUILD_SAFEBOX_MAX_NUM' was not declared in this scope
GuildSafeboxManager.h: In member function 'void CGuildSafebox::SetPassword(const char*)':
GuildSafeboxManager.h:36: error: 'm_szPassword' was not declared in this scope
GuildSafeboxManager.h: In member function 'const char* CGuildSafebox::GetPassword()':
GuildSafeboxManager.h:37: error: 'm_szPassword' was not declared in this scope
GuildSafeboxManager.h: In member function 'bool CGuildSafebox::CheckPassword(const char*) const':
GuildSafeboxManager.h:38: error: 'm_szPassword' was not declared in this scope
GuildSafeboxManager.h: In member function 'const TPlayerItem* CGuildSafebox::GetItem(BYTE) const':
GuildSafeboxManager.h:59: error: 'm_pItems' was not declared in this scope
In file included from Main.cpp:21:
GuildSafeboxManager.h:67: error: 'GUILD_SAFEBOX_PASSWORD_MAX_LEN' was not declared in this scope
GuildSafeboxManager.h:70: error: 'GUILD_SAFEBOX_MAX_NUM' was not declared in this scope
GuildSafeboxManager.h:71: error: 'GUILD_SAFEBOX_MAX_NUM' was not declared in this scope
GuildSafeboxManager.h: In member function 'void CGuildSafebox::SetPassword(const char*)':
GuildSafeboxManager.h:36: error: 'm_szPassword' was not declared in this scope
GuildSafeboxManager.h: In member function 'const char* CGuildSafebox::GetPassword()':
GuildSafeboxManager.h:37: error: 'm_szPassword' was not declared in this scope
GuildSafeboxManager.h: In member function 'bool CGuildSafebox::CheckPassword(const char*) const':
GuildSafeboxManager.h:38: error: 'm_szPassword' was not declared in this scope
GuildSafeboxManager.h: In member function 'const TPlayerItem* CGuildSafebox::GetItem(BYTE) const':
GuildSafeboxManager.h:59: error: 'm_pItems' was not declared in this scope
In file included from stdafx.h:16,
                 from CsvReader.cpp:1:
../../common/utils.h:112:7: warning: no newline at end of file
compile GuildSafeboxManager.cpp
ClientManager.cpp: In member function 'void CClientManager::QUERY_BOOT(CPeer*, TPacketGDBoot*)':
ClientManager.cpp:389: error: 'TGuildSafeboxInitial' was not declared in this scope
gmake: *** [.obj/Main.o] Error 1
gmake: *** Waiting for unfinished jobs....
ProtoReader.cpp: In function 'std::string* StringSplit(std::string, std::string)':
ProtoReader.cpp:33: warning: comparison between signed and unsigned integer expressions
ProtoReader.cpp: In function 'int get_Item_Type_Value(std::string)':
ProtoReader.cpp:88: warning: comparison between signed and unsigned integer expressions
ClientManager.cpp: In member function 'void CClientManager::ProcessPackets(CPeer*)':
ClientManager.cpp:2824: error: 'HEADER_GD_GUILD_SAFEBOX_ADD' was not declared in this scope
ClientManager.cpp:2825: error: 'HEADER_GD_GUILD_SAFEBOX_MOVE' was not declared in this scope
ClientManager.cpp:2826: error: 'HEADER_GD_GUILD_SAFEBOX_TAKE' was not declared in this scope
ClientManager.cpp:2827: error: 'HEADER_GD_GUILD_SAFEBOX_GIVE_GOLD' was not declared in this scope
ClientManager.cpp:2828: error: 'HEADER_GD_GUILD_SAFEBOX_GET_GOLD' was not declared in this scope
ClientManager.cpp:2829: error: 'HEADER_GD_GUILD_SAFEBOX_CREATE' was not declared in this scope
ClientManager.cpp:2830: error: 'HEADER_GD_GUILD_SAFEBOX_SIZE' was not declared in this scope
ClientManager.cpp:2831: error: 'HEADER_GD_GUILD_SAFEBOX_LOAD' was not declared in this scope
ProtoReader.cpp: In function 'int get_Item_SubType_Value(int, std::string)':
ProtoReader.cpp:207: warning: comparison between signed and unsigned integer expressions
ProtoReader.cpp:210: warning: comparison between signed and unsigned integer expressions
ProtoReader.cpp: In function 'int get_Item_AntiFlag_Value(std::string)':
ProtoReader.cpp:253: warning: comparison between signed and unsigned integer expressions
ProtoReader.cpp: In function 'int get_Item_Flag_Value(std::string)':
ProtoReader.cpp:282: warning: comparison between signed and unsigned integer expressions
ProtoReader.cpp: In function 'int get_Item_WearFlag_Value(std::string)':
ProtoReader.cpp:310: warning: comparison between signed and unsigned integer expressions
ProtoReader.cpp: In function 'int get_Item_Immune_Value(std::string)':
ProtoReader.cpp:336: warning: comparison between signed and unsigned integer expressions
ProtoReader.cpp: In function 'int get_Item_LimitType_Value(std::string)':
ProtoReader.cpp:364: warning: comparison between signed and unsigned integer expressions
ProtoReader.cpp: In function 'int get_Item_ApplyType_Value(std::string)':
ProtoReader.cpp:403: warning: comparison between signed and unsigned integer expressions
ProtoReader.cpp: In function 'int get_Mob_Rank_Value(std::string)':
ProtoReader.cpp:429: warning: comparison between signed and unsigned integer expressions
ProtoReader.cpp: In function 'int get_Mob_Type_Value(std::string)':
ProtoReader.cpp:451: warning: comparison between signed and unsigned integer expressions
ProtoReader.cpp: In function 'int get_Mob_BattleType_Value(std::string)':
ProtoReader.cpp:472: warning: comparison between signed and unsigned integer expressions
ProtoReader.cpp: In function 'int get_Mob_Size_Value(std::string)':
ProtoReader.cpp:493: warning: comparison between signed and unsigned integer expressions
ProtoReader.cpp: In function 'int get_Mob_AIFlag_Value(std::string)':
ProtoReader.cpp:515: warning: comparison between signed and unsigned integer expressions
ProtoReader.cpp: In function 'int get_Mob_RaceFlag_Value(std::string)':
ProtoReader.cpp:540: warning: comparison between signed and unsigned integer expressions
ProtoReader.cpp: In function 'int get_Mob_ImmuneFlag_Value(std::string)':
ProtoReader.cpp:564: warning: comparison between signed and unsigned integer expressions
ProtoReader.cpp: In function 'bool Set_Proto_Item_Table(TItemTable*, cCsvTable&, std::map<int, const char*, std::less<int>, std::allocator<std::pair<const int, const char*> > >&)':
ProtoReader.cpp:699: warning: comparison between signed and unsigned integer expressions
ProtoReader.cpp:760: warning: comparison between signed and unsigned integer expressions
In file included from stdafx.h:16,
                 from GuildSafeboxManager.cpp:1:
../../common/utils.h:112:7: warning: no newline at end of file
CsvReader.cpp: In member function 'const char* cCsvAlias::operator[](size_t) const':
CsvReader.cpp:72: warning: left-hand operand of comma has no effect
CsvReader.cpp:72: warning: right-hand operand of comma has no effect
CsvReader.cpp: In member function 'size_t cCsvAlias::operator[](const char*) const':
CsvReader.cpp:90: warning: left-hand operand of comma has no effect
CsvReader.cpp:90: warning: right-hand operand of comma has no effect
gmake: *** [.obj/ClientManager.o] Error 1
In file included from GuildSafeboxManager.cpp:4:
GuildSafeboxManager.h:67: error: 'GUILD_SAFEBOX_PASSWORD_MAX_LEN' was not declared in this scope
GuildSafeboxManager.h:70: error: 'GUILD_SAFEBOX_MAX_NUM' was not declared in this scope
GuildSafeboxManager.h:71: error: 'GUILD_SAFEBOX_MAX_NUM' was not declared in this scope
GuildSafeboxManager.h: In member function 'void CGuildSafebox::SetPassword(const char*)':
GuildSafeboxManager.h:36: error: 'm_szPassword' was not declared in this scope
GuildSafeboxManager.h: In member function 'const char* CGuildSafebox::GetPassword()':
GuildSafeboxManager.h:37: error: 'm_szPassword' was not declared in this scope
GuildSafeboxManager.h: In member function 'bool CGuildSafebox::CheckPassword(const char*) const':
GuildSafeboxManager.h:38: error: 'm_szPassword' was not declared in this scope
GuildSafeboxManager.h: In member function 'const TPlayerItem* CGuildSafebox::GetItem(BYTE) const':
GuildSafeboxManager.h:59: error: 'm_pItems' was not declared in this scope
GuildSafeboxManager.cpp: In constructor 'CGuildSafebox::CGuildSafebox(DWORD)':
GuildSafeboxManager.cpp:20: error: 'm_szPassword' was not declared in this scope
GuildSafeboxManager.cpp:23: error: 'm_pItems' was not declared in this scope
GuildSafeboxManager.cpp:24: error: 'm_bItemGrid' was not declared in this scope
GuildSafeboxManager.cpp: In destructor 'CGuildSafebox::~CGuildSafebox()':
GuildSafeboxManager.cpp:28: error: 'GUILD_SAFEBOX_MAX_NUM' was not declared in this scope
GuildSafeboxManager.cpp:30: error: 'm_pItems' was not declared in this scope
GuildSafeboxManager.cpp: In member function 'void CGuildSafebox::ChangeSize(BYTE, CPeer*)':
GuildSafeboxManager.cpp:42: error: 'HEADER_DG_GUILD_SAFEBOX_SIZE' was not declared in this scope
GuildSafeboxManager.cpp: In member function 'void CGuildSafebox::ChangeGold(int)':
GuildSafeboxManager.cpp:52: error: 'HEADER_DG_GUILD_SAFEBOX_GOLD' was not declared in this scope
GuildSafeboxManager.cpp: In member function 'void CGuildSafebox::LoadItems(SQLMsg*)':
GuildSafeboxManager.cpp:68: error: 'GUILD_SAFEBOX' was not declared in this scope
GuildSafeboxManager.cpp:79: error: 'struct TPlayerItem' has no member named 'is_gm_owner'
GuildSafeboxManager.cpp:97: error: 'GUILD_SAFEBOX_MAX_NUM' was not declared in this scope
GuildSafeboxManager.cpp:110: error: 'm_pItems' was not declared in this scope
GuildSafeboxManager.cpp:112: error: 'm_bItemGrid' was not declared in this scope
GuildSafeboxManager.cpp: In member function 'void CGuildSafebox::DeleteItems()':
GuildSafeboxManager.cpp:124: error: 'GUILD_SAFEBOX' was not declared in this scope
GuildSafeboxManager.cpp:127: error: 'GUILD_SAFEBOX_MAX_NUM' was not declared in this scope
GuildSafeboxManager.cpp:131: error: 'm_pItems' was not declared in this scope
GuildSafeboxManager.cpp:136: error: 'm_bItemGrid' was not declared in this scope
GuildSafeboxManager.cpp: In member function 'bool CGuildSafebox::IsValidCell(BYTE, BYTE) const':
GuildSafeboxManager.cpp:142: error: 'GUILD_SAFEBOX_MAX_NUM' was not declared in this scope
GuildSafeboxManager.cpp:142: error: 'GUILD_SAFEBOX_ITEM_WIDTH' was not declared in this scope
GuildSafeboxManager.cpp: In member function 'bool CGuildSafebox::IsFree(BYTE, BYTE) const':
GuildSafeboxManager.cpp:158: error: 'GUILD_SAFEBOX_ITEM_WIDTH' was not declared in this scope
GuildSafeboxManager.cpp:158: error: 'GUILD_SAFEBOX_ITEM_HEIGHT' was not declared in this scope
GuildSafeboxManager.cpp:175: error: 'm_bItemGrid' was not declared in this scope
GuildSafeboxManager.cpp: In member function 'void CGuildSafebox::RequestAddItem(CPeer*, DWORD, const TPlayerItem*)':
GuildSafeboxManager.cpp:205: error: 'm_pItems' was not declared in this scope
GuildSafeboxManager.cpp:207: error: 'GUILD_SAFEBOX' was not declared in this scope
GuildSafeboxManager.cpp:209: error: 'm_bItemGrid' was not declared in this scope
GuildSafeboxManager.cpp:209: error: 'GUILD_SAFEBOX_ITEM_WIDTH' was not declared in this scope
GuildSafeboxManager.cpp: In member function 'void CGuildSafebox::RequestMoveItem(BYTE, BYTE)':
GuildSafeboxManager.cpp:221: error: 'm_pItems' was not declared in this scope
GuildSafeboxManager.cpp:237: error: 'm_bItemGrid' was not declared in this scope
GuildSafeboxManager.cpp:237: error: 'GUILD_SAFEBOX_ITEM_WIDTH' was not declared in this scope
GuildSafeboxManager.cpp:242: error: 'm_bItemGrid' was not declared in this scope
GuildSafeboxManager.cpp:242: error: 'GUILD_SAFEBOX_ITEM_WIDTH' was not declared in this scope
GuildSafeboxManager.cpp: In member function 'void CGuildSafebox::RequestTakeItem(CPeer*, DWORD, BYTE, BYTE)':
GuildSafeboxManager.cpp:255: error: 'm_pItems' was not declared in this scope
GuildSafeboxManager.cpp:265: error: 'm_bItemGrid' was not declared in this scope
GuildSafeboxManager.cpp:265: error: 'GUILD_SAFEBOX_ITEM_WIDTH' was not declared in this scope
GuildSafeboxManager.cpp: In member function 'void CGuildSafebox::GiveItemToPlayer(CPeer*, DWORD, const TPlayerItem*)':
GuildSafeboxManager.cpp:282: error: 'HEADER_DG_GUILD_SAFEBOX_GIVE' was not declared in this scope
GuildSafeboxManager.cpp: In member function 'void CGuildSafebox::SendItemPacket(BYTE)':
GuildSafeboxManager.cpp:288: error: 'm_pItems' was not declared in this scope
GuildSafeboxManager.cpp:289: error: 'HEADER_DG_GUILD_SAFEBOX_SET' was not declared in this scope
GuildSafeboxManager.cpp:291: error: 'HEADER_DG_GUILD_SAFEBOX_DEL' was not declared in this scope
GuildSafeboxManager.cpp: In member function 'void CGuildSafebox::LoadItems(CPeer*, DWORD)':
GuildSafeboxManager.cpp:300: error: 'HEADER_DG_GUILD_SAFEBOX_LOAD' was not declared in this scope
GuildSafeboxManager.cpp:309: error: 'GUILD_SAFEBOX_MAX_NUM' was not declared in this scope
GuildSafeboxManager.cpp:317: error: 'HEADER_DG_GUILD_SAFEBOX_LOAD' was not declared in this scope
GuildSafeboxManager.cpp: In member function 'void CGuildSafeboxManager::Initialize()':
GuildSafeboxManager.cpp:368: warning: comparison between signed and unsigned integer expressions
GuildSafeboxManager.cpp:394: warning: zero-length printf format string
GuildSafeboxManager.cpp:394: warning: zero-length printf format string
GuildSafeboxManager.cpp:406: error: 'GUILD_SAFEBOX' was not declared in this scope
GuildSafeboxManager.cpp:394: warning: unused variable 'len'
GuildSafeboxManager.cpp: In member function 'void CGuildSafeboxManager::SaveSingleItem(TPlayerItem*)':
GuildSafeboxManager.cpp:480: error: 'GUILD_SAFEBOX' was not declared in this scope
GuildSafeboxManager.cpp:486: warning: zero-length printf format string
GuildSafeboxManager.cpp:486: warning: zero-length printf format string
GuildSafeboxManager.cpp:498: error: 'struct SPlayerItem' has no member named 'is_gm_owner'
GuildSafeboxManager.cpp:486: warning: unused variable 'len'
GuildSafeboxManager.cpp: In member function 'void CGuildSafeboxManager::ProcessPacket(CPeer*, DWORD, BYTE, const void*)':
GuildSafeboxManager.cpp:583: error: 'HEADER_GD_GUILD_SAFEBOX_ADD' was not declared in this scope
GuildSafeboxManager.cpp:597: error: 'HEADER_DG_GUILD_SAFEBOX_GIVE' was not declared in this scope
GuildSafeboxManager.cpp:603: error: 'HEADER_GD_GUILD_SAFEBOX_MOVE' was not declared in this scope
GuildSafeboxManager.cpp:605: error: expected initializer before '*' token
GuildSafeboxManager.cpp:606: error: 'p' was not declared in this scope
GuildSafeboxManager.cpp:614: error: 'HEADER_GD_GUILD_SAFEBOX_TAKE' was not declared in this scope
GuildSafeboxManager.cpp:616: error: expected initializer before '*' token
GuildSafeboxManager.cpp:617: error: 'p' was not declared in this scope
GuildSafeboxManager.cpp:625: error: 'HEADER_GD_GUILD_SAFEBOX_GIVE_GOLD' was not declared in this scope
GuildSafeboxManager.cpp:627: error: expected initializer before '*' token
GuildSafeboxManager.cpp:628: error: 'p' was not declared in this scope
GuildSafeboxManager.cpp:636: error: 'HEADER_GD_GUILD_SAFEBOX_GET_GOLD' was not declared in this scope
GuildSafeboxManager.cpp:638: error: expected initializer before '*' token
GuildSafeboxManager.cpp:639: error: 'p' was not declared in this scope
GuildSafeboxManager.cpp:642: error: 'HEADER_DG_GUILD_SAFEBOX_GOLD' was not declared in this scope
GuildSafeboxManager.cpp:661: error: 'HEADER_GD_GUILD_SAFEBOX_CREATE' was not declared in this scope
GuildSafeboxManager.cpp:688: error: 'HEADER_DG_GUILD_SAFEBOX_CREATE' was not declared in this scope
GuildSafeboxManager.cpp:695: error: 'HEADER_GD_GUILD_SAFEBOX_SIZE' was not declared in this scope
GuildSafeboxManager.cpp:710: error: 'HEADER_GD_GUILD_SAFEBOX_LOAD' was not declared in this scope
GuildSafeboxManager.cpp: In member function 'void CGuildSafeboxManager::InitSafeboxCore(CPeer*)':
GuildSafeboxManager.cpp:731: error: 'TGuildSafeboxInitial' was not declared in this scope
GuildSafeboxManager.cpp:731: error: expected `;' before 'init'
GuildSafeboxManager.cpp:732: error: 'init' was not declared in this scope
gmake: *** [.obj/GuildSafeboxManager.o] Error 1
yagokurt is offline  
Old 06/16/2015, 11:22   #195
 
elite*gold: 0
Join Date: Oct 2009
Posts: 428
Received Thanks: 191
Code:
compile GuildSafeboxManager.cpp
GuildSafeboxManager.cpp: In member function 'void CGuildSafebox::LoadItems(SQLMsg*)':
GuildSafeboxManager.cpp:79: error: 'struct TPlayerItem' has no member named 'is_gm_owner'
GuildSafeboxManager.cpp: In member function 'void CGuildSafeboxManager::SaveSingleItem(TPlayerItem*)':
GuildSafeboxManager.cpp:498: error: 'struct SPlayerItem' has no member named 'is_gm_owner'
Makefile:52: recipe for target '.obj/GuildSafeboxManager.o' failed
gmake: *** [.obj/GuildSafeboxManager.o] Error 1
gmake: *** Waiting for unfinished jobs....
Anyone know how to fix this?
dstyl is offline  
Reply


Similar Threads Similar Threads
Gildenlager
01/17/2015 - Metin2 Private Server - 1 Replies
Hey, kann mir einer pls helfen beim Gildenlager ? Und zwar geht es dadrum, dass ich beim Gildenlager rechte verteile, jedoch kann ich die Rechte nicht verwenden. Ab und zu kann ich sogar kein Namen eintragen, um überhaupt Rechte zu verteilen... ?
Gildenlager Bug or so :D
01/16/2015 - Metin2 Private Server - 5 Replies
Tag,hab mir mal das Gildenlager eingebaut,soweit geht alles jedoch kann ich keine Items in das Lager lagern aber Yang geht. Hoffentlich kennt jemand eine Lösung Screen Screenshot by Lightshot Screenshot by Lightshot Syserr spuckt nichts aus
[Buying] Gildenlager
12/16/2014 - Metin2 Trading - 1 Replies
Servus! Suche die komplett entbuggte Version des Gildenlager's. Bitte in Skype oder per PN melden. LG _Point_
[Rls]Gildenlager Only Quest
09/03/2014 - Metin2 PServer Guides & Strategies - 13 Replies
#deleted
[Verbesserungsvorschläge] Gildenlager
02/14/2014 - Metin2 Private Server - 46 Replies
Guten Abend , da .He3o Copy und ich nun fast mit dem Gildenlager fertig sind wollten wir mal Wissen ob ihr noch ein paar Verbesserungsvorschläge für uns hättet. http://i.epvpimg.com/SX3Wc.jpg



All times are GMT +1. The time now is 14:43.


Powered by vBulletin®
Copyright ©2000 - 2021, Jelsoft Enterprises Ltd.
SEO by vBSEO ©2011, Crawlability, Inc.
This site is protected by reCAPTCHA and the Google Privacy Policy and Terms of Service apply.

BTC: 33E6kMtxYa7dApCFzrS3Jb7U3NrVvo8nsK
ETH: 0xc6ec801B7563A4376751F33b0573308aDa611E05

Support | Contact Us | FAQ | Advertising | Privacy Policy | Terms of Service | Abuse
Copyright ©2021 elitepvpers All Rights Reserved.